program: Gaussian 09
title: 000299003
version: EM64L-G09RevD.01
frameworkgroup: C1[X(C17H14O5)]
method: RPBEPBE
basis: SDD
operation: Freq
keyword: #pfreq=noraman
keyword: PBEPBE/SDD
title: #p freq=noraman PBEPBE/SDD
converged: YES YES NO NO
title: Mulliken charges:
elementType: O O O O O C C C C C C C C C C C C C C C C C H H H H H H H H H H H H H H
charge: -0.211684 -0.286109 -0.284099 -0.245372 -0.247145 0.316076 0.312974 0.002854 -0.361933 -0.354455 -0.358017 -0.362472 0.238542 0.237623 -0.340738 -0.335920 -0.354348 -0.359495 0.173550 0.173116 -0.499622 -0.499371 0.270897 0.275181 0.276839 0.272101 0.276392 0.276364 0.275342 0.274883 0.245063 0.244857 0.233992 0.234856 0.244588 0.244693
chargesum: 0.00000
title: Mulliken charges with hydrogens summed into heavy atoms:
elementType: O O O O O C C C C C C C C C C C C C C C C C
charge: -0.211684 -0.286109 -0.284099 -0.245372 -0.247145 0.316076 0.312974 0.002854 -0.091035 -0.079274 -0.081178 -0.090372 0.238542 0.237623 -0.064347 -0.059556 -0.079006 -0.084612 0.173550 0.173116 0.224289 0.224766
polarizability: 3.51956566e+02 -1.35291025e+00 1.99328261e+02 -1.60971075e+01 -3.20722185e+00 1.10605238e+02
1716.lowfreq: -2.2431 0.0004 0.0006 0.0011 3.6159 7.9968 24.9600 31.7393 36.1110
frequency: 24.9144 31.7304 36.1083 59.3302 68.4113 77.0067 89.0354 98.1833 104.4458 113.4329 133.9684 142.5643 169.5530 208.3663 219.0015 250.3134 273.4086 290.4357 304.3230 307.5403 404.3859 408.3854 417.9803 426.9836 449.4715 472.1633 483.3561 493.6819 577.4644 625.8563 631.5331 657.1017 674.7100 684.6878 705.5597 711.8638 762.1417 769.2008 783.0961 794.2623 865.6850 876.1882 881.7256 888.2269 918.1961 920.2120 922.9755 994.5740 1001.4464 1005.5482 1008.4059 1013.3864 1015.3867 1070.7559 1072.2282 1114.0061 1114.6117 1117.2404 1120.7804 1148.7444 1149.4579 1151.2425 1187.3145 1190.6604 1247.6207 1255.0772 1284.4538 1304.6258 1308.0096 1376.3482 1377.7869 1407.9101 1408.7095 1424.0689 1424.4022 1451.5025 1451.9819 1463.0247 1463.0581 1489.5487 1494.6306 1533.4892 1565.2726 1576.3940 1615.4676 1617.5317 1623.7531 1626.1514 3005.7301 3005.7869 3107.6489 3107.7713 3146.8312 3151.4498 3151.6466 3151.9672 3152.3380 3156.8397 3167.4004 3170.4983 3180.6135 3182.1732
redmass: 4.8713 6.0486 5.1695 3.9697 4.4545 3.1142 1.2640 1.4110 3.2149 5.3182 4.5519 4.2496 4.9666 5.9820 5.5171 6.3553 6.6514 7.9204 4.7513 4.7724 2.8489 4.4108 3.6046 5.5875 5.8007 4.9469 5.9889 5.2073 5.4582 7.0246 7.1794 5.8743 6.3809 4.5148 3.0428 5.9304 4.2191 6.0349 6.2223 4.5030 1.2953 1.3234 1.5060 2.0041 5.7047 8.0992 6.5501 1.3655 1.3737 1.4535 1.4919 2.8327 2.4884 4.4076 4.6690 1.2646 1.2643 1.4061 1.3764 1.9139 1.4846 2.2175 1.1256 1.1596 3.3747 3.9795 4.6772 1.3388 1.2735 5.9988 5.6241 3.8484 3.8130 1.1876 1.1908 1.0497 1.0495 1.0515 1.0514 2.4826 2.5715 10.2919 7.5633 8.4053 6.4638 6.5920 9.6366 9.2381 1.0296 1.0296 1.1045 1.1045 1.0885 1.1042 1.1047 1.0891 1.0888 1.0894 1.0964 1.0968 1.0959 1.0962
irintensity: 0.5653 0.2057 1.7338 0.8219 0.0626 1.5081 0.5991 2.2698 0.3363 0.5121 1.7125 13.1174 1.1263 1.2366 1.7020 16.1743 10.1636 1.8389 25.5177 4.8062 0.5332 1.1849 0.1409 10.8023 3.7883 1.5472 9.7703 7.2278 0.2832 0.3331 0.5892 6.4274 5.8762 8.3150 106.4414 5.1558 3.0729 19.7073 4.1155 5.0811 15.7780 7.4386 12.2949 56.8655 55.4550 5.0027 41.9253 0.9917 5.0063 19.1552 4.6852 7.5729 42.2176 237.6208 203.2757 0.0231 0.0227 5.0837 8.7139 18.8085 107.3443 9.0004 5.0606 16.5757 784.0274 144.0327 148.4717 11.6464 0.3421 21.9874 3.2055 26.3765 26.0583 23.1448 28.2374 14.6541 14.7017 14.7019 9.1735 7.4373 36.8421 98.3019 16.6624 91.2856 37.8354 14.1734 176.5714 143.8981 65.8391 14.9541 24.1646 25.2971 7.6229 12.5959 14.8594 5.0684 0.6947 0.5785 4.3688 2.2191 0.9416 1.1636
temp: 298.150 k
press: 1.00000 atm
elementType: 8 8 8 8 8 6 6 6 6 6 6 6 6 6 6 6 6 6 6 6 6 6 1 1 1 1 1 1 1 1 1 1 1 1 1 1
symmnumber: 1
zpe: 707677.7 jmol-1
zpe.correction: 0.269540 hartree
zpe.thermalcorrener: 0.290098 hartree
zpe.thermalcorrenthalpy: 0.291042 hartree
zpe.thermalcorrgfe: 0.217547 hartree
zpe.sumelectzpe: -1030.783816 hartree
zpe.sumelectthermal: -1030.763259 hartree
zpe.sumelectthermalent: -1030.762314 hartree
zpe.sumelectthermalfe: -1030.835809 hartree
dipole: 1.2608 -2.9707 -1.4924
dipole: 3.5556
quadrupole: -102.7686 -132.4314 -126.7750
quadrupole: 16.7053 -2.6741 3.9440
quadrupole: 17.8898 -11.7731 -6.1167 16.7053 -2.6741 3.9440
hfenergy: -1031.0533567 hartree
pointgroup: C01 [X(C17H14O5)]
dipole: -0.4915179 1.2984289 -0.1712424 debye
polarizability: 350.1491397|-7.8874488|186.6832103|25.0853466|30.8522262|125.057715 unknown
InChI: InChI=1S/C17H14O5/c1-21-16(19)13-7-3-11(4-8-13)15(18)12-5-9-14(10-6-12)17(20)22-2/h3-10H,1-2H3
charge 0 multiplicity 1
36 atoms
O  -0.010177 -2.749144 -1.294621
O  5.335563 2.024391 0.371535
O  -6.081792 0.667851 -0.608443
O  6.274233 -0.081707 0.706682
O  -5.261021 1.878388 1.205353
C  1.342644 -0.964081 -0.423521
C  -1.268291 -0.860613 -0.503857
C  0.019853 -1.591312 -0.771102
C  1.551625 0.442196 -0.443091
C  -2.3931 -1.171037 -1.315997
C  2.438993 -1.82509 -0.143623
C  -1.419671 0.060951 0.568531
C  3.908926 0.112275 0.127429
C  -3.777366 0.371477 -0.018266
C  2.827056 0.977423 -0.175899
C  -3.635229 -0.555189 -1.085244
C  3.707846 -1.293807 0.140153
C  -2.666568 0.667149 0.812352
C  5.276759 0.629076 0.430951
C  -5.072542 1.054046 0.27687
C  6.66404 2.616082 0.656083
C  -7.403584 1.297473 -0.379582
H  0.72636 1.114231 -0.698643
H  -2.267631 -1.904285 -2.119009
H  2.26965 -2.906317 -0.16101
H  -0.573896 0.277024 1.228777
H  2.997848 2.05679 -0.201335
H  -4.500186 -0.781284 -1.714154
H  4.558631 -1.943125 0.370065
H  -2.803452 1.36934 1.641004
H  7.406012 2.255574 -0.075996
H  6.9948 2.33981 1.671294
H  6.512673 3.700784 0.567872
H  -8.047069 0.894986 -1.173995
H  -7.320548 2.395002 -0.449185
H  -7.785888 1.026674 0.618923
