program: Gaussian 09
title: 000027080
version: EM64L-G09RevD.01
frameworkgroup: C1[X(C20H34N2O2)]
method: RPBEPBE
basis: SDD
operation: Freq
keyword: #p
keyword: freq=noraman
keyword: PBEPBE/SDD
title: #p freq=noraman PBEPBE/SDD
converged: YES YES NO NO
title: Mulliken charges:
elementType: O O N N C C C C C C C C C C C C C C C C C C C C H H H H H H H H H H H H H H H H H H H H H H H H H H H H H H H H H H
charge: -0.310996 -0.270892 -0.113481 -0.685813 -0.364254 -0.367039 -0.373622 -0.374660 -0.368743 -0.334640 -0.342436 -0.407790 -0.357619 -0.354253 -0.252018 -0.695871 -0.699162 0.201000 0.226900 -0.341246 -0.333279 -0.406451 -0.402174 0.499279 0.181488 0.198550 0.180035 0.200183 0.225538 0.196597 0.205382 0.189762 0.203746 0.201920 0.182024 0.183226 0.180619 0.179394 0.207471 0.193507 0.195160 0.198589 0.199866 0.203047 0.248983 0.222972 0.209200 0.209651 0.215859 0.207064 0.208220 0.214883 0.266084 0.261628 0.220421 0.218339 0.309571 0.310278
chargesum: 0.00000
title: Mulliken charges with hydrogens summed into heavy atoms:
elementType: O O N N C C C C C C C C C C C C C C C C C C C C
charge: -0.310996 -0.270892 -0.113481 -0.065964 0.015784 0.013180 0.048514 0.020484 0.036924 0.030610 0.017577 -0.006811 0.036130 0.048661 0.219937 -0.061161 -0.068996 0.201000 0.226900 -0.075162 -0.071651 -0.186030 -0.183834 0.499279
polarizability: 3.34541877e+02 3.92878684e+01 1.95726214e+02 -8.96130720e+00 -7.08053835e-01 2.14036794e+02
1716.lowfreq: -6.0907 -0.0008 0.0005 0.0011 1.8730 5.5705 6.3872 12.9882 15.9643
frequency: 3.5168 12.7604 15.8436 24.3537 37.5863 38.3420 43.3423 46.1050 63.6002 79.1388 92.0853 97.8195 113.7387 121.0276 124.0579 127.2928 131.7523 167.5980 196.0878 221.7613 229.8143 231.7279 241.9138 258.3443 285.5305 295.2107 297.4386 313.6069 343.4406 363.8870 372.9858 395.1484 406.0331 408.7676 415.4368 429.7762 469.1345 487.1749 507.8366 516.1393 540.0527 605.5485 634.3348 677.0499 724.5246 725.7792 739.2526 754.2257 756.1759 756.7559 785.7139 816.2385 824.6917 829.0733 840.8991 842.9806 844.0221 873.0047 889.8998 895.8114 908.6213 957.2481 960.4467 971.7313 984.0981 990.1387 998.1501 1008.8422 1017.0673 1019.1447 1028.4447 1056.5601 1058.2829 1062.3520 1075.6755 1076.9185 1087.6882 1098.4936 1108.6648 1117.3234 1125.4837 1129.5590 1164.3773 1179.2120 1184.6743 1198.3364 1210.2852 1223.7087 1239.3586 1248.0289 1251.9587 1257.7478 1273.6633 1277.2621 1280.4581 1283.5524 1287.1303 1296.2439 1298.3567 1307.0313 1318.2416 1323.5559 1323.8118 1345.8709 1351.5695 1354.1823 1357.0258 1367.1304 1370.9642 1382.3956 1385.5475 1389.9500 1391.4643 1445.1896 1446.3804 1463.3889 1463.8508 1465.4408 1466.7367 1471.1233 1473.9699 1474.3865 1476.2174 1477.5268 1479.0004 1482.2328 1483.3799 1488.7744 1489.6045 1517.0147 1570.4669 1611.0177 1631.5827 1645.6453 2838.2552 2846.7302 2878.2939 2947.6104 2951.2652 2966.9718 2968.0850 2969.3909 2971.7871 2976.4198 2977.9279 2986.8867 2988.6138 2990.8564 3006.1201 3012.9129 3013.7032 3020.7335 3022.3839 3038.8261 3044.3298 3046.8200 3059.3923 3065.8188 3068.2607 3068.8231 3070.8438 3085.1244 3122.2110 3125.0330 3157.9508 3171.0527 3561.3738 3701.3613
redmass: 4.6410 4.6666 4.3920 3.8554 3.2484 4.0826 1.7510 1.6391 4.2653 3.0456 3.3976 5.0154 2.5731 2.6002 2.5103 2.1927 2.4549 4.4931 2.7056 2.5450 1.1489 1.1163 4.3548 2.6193 3.2387 4.4395 3.5239 3.7987 2.7665 3.4299 2.6085 2.8671 1.2331 1.0802 2.5720 2.5198 3.1802 3.0094 2.8368 3.0240 3.1444 6.5487 6.8858 4.0141 1.0723 1.0679 1.8722 4.2541 1.2089 1.1717 5.3347 2.8461 1.2648 4.6073 1.2523 1.7907 1.3110 2.4880 1.9339 2.0321 2.3454 1.2719 1.2020 1.3596 1.3500 2.2497 3.1223 3.2496 1.5307 2.5909 2.5009 2.6390 3.1334 3.1439 2.3729 2.3747 2.0068 2.2754 2.0858 2.3472 2.2924 1.2157 1.7220 1.1555 1.9684 1.2265 1.3585 1.4631 1.3761 1.3936 1.9960 1.5639 1.2179 1.3213 1.0634 1.0767 1.1605 1.1612 1.1753 1.3206 1.3852 1.4263 2.7094 1.3931 1.5985 1.6066 1.5184 1.4112 1.3871 1.4135 1.2271 1.2200 4.8538 1.0963 4.1465 1.0704 1.0713 1.0741 1.0729 1.0812 1.0690 1.0711 1.0428 1.0434 1.0919 1.0760 1.0740 1.0909 1.0927 3.1978 7.3440 10.1883 3.1844 1.4464 1.0711 1.0708 1.0716 1.0585 1.0586 1.0590 1.0515 1.0439 1.0365 1.0613 1.0604 1.0599 1.0980 1.0969 1.0868 1.0874 1.0618 1.1019 1.1002 1.0965 1.1031 1.1023 1.0914 1.1008 1.1007 1.0992 1.0992 1.1067 1.0894 1.0892 1.0952 1.0948 1.0450 1.1040
irintensity: 0.0934 1.1708 0.3975 0.1848 0.1631 0.9878 0.1134 0.1356 1.5626 0.3947 0.1089 0.4446 0.6790 0.6461 0.4804 0.4942 0.0640 0.7306 2.2884 2.6730 0.0279 0.0097 5.6768 1.7142 1.1177 11.9494 6.3839 0.2298 3.2990 6.6082 0.6866 6.6899 297.0930 16.5911 0.0112 0.6089 5.8957 3.5952 3.8027 4.7080 1.0779 12.5864 1.7795 31.3273 8.6057 9.4404 12.6048 14.5382 1.5940 0.8252 3.8493 0.5057 1.0625 2.5710 4.9009 68.2378 5.3776 11.2895 11.2028 13.7607 23.6346 3.0970 2.2417 0.4960 0.2351 5.1727 26.0365 0.8859 11.3922 0.5815 16.4208 51.5109 188.8492 99.7925 1.8574 0.4908 25.4275 100.7928 13.4600 2.8176 3.9455 13.0453 7.6522 181.0120 5.9736 6.0371 5.2443 2.8474 21.3427 36.2103 240.6625 59.9594 0.8953 7.5184 1.3015 1.2636 7.3858 4.8691 8.2348 2.2382 0.8198 20.7970 88.3880 15.7752 0.4572 1.8814 3.1134 9.6615 16.7441 0.3749 13.3385 12.6668 10.7570 9.4879 5.6108 1.9343 1.6715 1.2416 0.9736 8.1849 0.9235 3.1869 11.3048 11.8152 12.5719 1.8228 2.4334 24.5064 15.2975 67.9078 26.1467 309.0997 89.0424 325.4653 40.0664 122.6895 139.1876 22.7129 16.0201 31.9365 51.0561 21.2612 44.1985 49.5250 63.0816 33.0947 6.2933 4.9398 20.3030 23.2856 26.8653 4.2841 2.1057 25.0040 51.2913 73.1153 59.2503 101.8749 93.3479 53.2420 54.1568 23.3629 15.3998 23.1010 9.2305 3.9959 107.7860 22.4855
temp: 298.150 k
press: 1.00000 atm
elementType: 8 8 7 7 6 6 6 6 6 6 6 6 6 6 6 6 6 6 6 6 6 6 6 6 1 1 1 1 1 1 1 1 1 1 1 1 1 1 1 1 1 1 1 1 1 1 1 1 1 1 1 1 1 1 1 1 1 1
symmnumber: 1
zpe: 1331397.7 jmol-1
zpe.correction: 0.507103 hartree
zpe.thermalcorrener: 0.535438 hartree
zpe.thermalcorrenthalpy: 0.536383 hartree
zpe.thermalcorrgfe: 0.441338 hartree
zpe.sumelectzpe: -1040.584818 hartree
zpe.sumelectthermal: -1040.556482 hartree
zpe.sumelectthermalent: -1040.555538 hartree
zpe.sumelectthermalfe: -1040.650583 hartree
dipole: 2.8984 1.4837 -3.3274
dipole: 4.6555
quadrupole: -102.2604 -152.2035 -148.6823
quadrupole: 9.3249 -5.7971 5.0118
quadrupole: 32.1217 -17.8214 -14.3003 9.3249 -5.7971 5.0118
hfenergy: -1041.0919205 hartree
pointgroup: C01 [X(C20H34N2O2)]
dipole: 1.1024415 0.7699059 -1.2436656 debye
polarizability: 333.1045023|42.0968681|197.4651094|-6.1763688|-4.0632388|213.7352739 unknown
InChI: InChI=1S/C20H34N2O2/c1-3-5-7-14-22(15-8-6-4-2)16-9-17-24-20(23)18-10-12-19(21)13-11-18/h10-13H,3-9,14-17,21H2,1-2H3
charge 0 multiplicity 1
58 atoms
O  0.893691 -1.735387 -0.423051
O  1.422378 -1.933716 1.841825
N  -2.345184 0.046572 -0.902593
N  6.9169 0.477847 -0.692046
C  -3.803214 -0.16673 -1.091277
C  -1.961154 1.479596 -0.803774
C  -1.518215 -0.719537 -1.869865
C  -4.620023 -0.001518 0.208252
C  -0.678283 1.701352 0.025679
C  -6.136707 -0.197491 -0.014197
C  -0.23787 3.181803 0.065148
C  -1.276225 -2.177532 -1.413352
C  -6.963388 -0.068278 1.285625
C  1.053766 3.401578 0.885885
C  -0.472035 -2.255769 -0.116515
C  -8.478262 -0.262986 1.059533
C  1.506768 4.877236 0.914976
C  1.761971 -1.610816 0.672402
C  3.083595 -1.06861 0.280065
C  4.062336 -0.86618 1.291003
C  3.413303 -0.743839 -1.064118
C  5.32941 -0.3552 0.977224
C  4.678756 -0.232654 -1.390397
C  5.660998 -0.028555 -0.373489
H  -4.217837 0.513355 -1.880268
H  -3.951993 -1.198783 -1.464654
H  -1.832985 1.939623 -1.818097
H  -2.792417 2.025504 -0.318696
H  -0.535503 -0.225425 -1.964369
H  -1.976379 -0.723105 -2.889351
H  -4.245179 -0.731661 0.952001
H  -4.442244 1.003624 0.641244
H  -0.856929 1.328288 1.053394
H  0.148613 1.088289 -0.385598
H  -6.319313 -1.197306 -0.462447
H  -6.502397 0.545129 -0.754645
H  -1.053109 3.803976 0.492057
H  -0.077897 3.548664 -0.971259
H  -0.751445 -2.734211 -2.214377
H  -2.246129 -2.685964 -1.243395
H  -6.780641 0.929086 1.735581
H  -6.599289 -0.811951 2.023383
H  0.891387 3.041529 1.921978
H  1.862656 2.770433 0.46447
H  -0.925694 -1.623568 0.666537
H  -0.37307 -3.289772 0.260935
H  -8.872682 0.486649 0.347551
H  -8.691429 -1.265375 0.642136
H  -9.044898 -0.163181 2.003675
H  1.706399 5.251165 -0.107436
H  0.726407 5.523263 1.360561
H  2.43091 5.005514 1.50837
H  3.801113 -1.120319 2.323868
H  2.665158 -0.903194 -1.845954
H  6.073192 -0.204718 1.76909
H  4.920391 0.011709 -2.432116
H  7.1585 0.709624 -1.651305
H  7.618821 0.621827 0.028293
