program: Gaussian 09
title: 000298984
version: EM64L-G09RevD.01
frameworkgroup: C1[X(C16H21N)]
method: RPBEPBE
basis: SDD
operation: Freq
keyword: #pfreq=noraman
keyword: PBEPBE/SDD
title: #p freq=noraman PBEPBE/SDD
converged: YES YES NO NO
title: Mulliken charges:
elementType: N C C C C C C C C C C C C C C C C H H H H H H H H H H H H H H H H H H H H H
charge: -0.548160 -0.186955 -0.438002 0.386255 -0.345724 -0.460909 0.156049 -0.351295 -0.437484 0.401656 -0.382242 -0.263677 -0.466364 -0.698981 -0.431409 -0.270640 -0.247230 0.187536 0.179635 0.187797 0.185406 0.216484 0.238750 0.218101 0.193760 0.189970 0.237024 0.225831 0.223576 0.237617 0.264684 0.272434 0.212834 0.214608 0.210148 0.236466 0.224637 0.227813
chargesum: 0.00000
title: Mulliken charges with hydrogens summed into heavy atoms:
elementType: N C C C C C C C C C C C C C C C C
charge: -0.011043 0.000580 -0.070570 0.386255 0.056167 -0.004057 0.156049 0.032435 -0.200459 0.401656 -0.156411 -0.040101 -0.228747 -0.061391 -0.194944 -0.046003 -0.019417
polarizability: 2.22124321e+02 1.46236937e+01 1.72356193e+02 3.01135771e+01 -3.18669503e+01 1.54379696e+02
1716.lowfreq: -11.2932 -0.0007 -0.0005 0.0005 5.3062 7.8630 21.7256 44.3584 65.2255
frequency: 21.4273 44.3392 65.2222 73.8892 83.7198 114.5382 136.1300 155.6376 176.6422 194.7718 231.6860 238.7395 267.6171 282.8428 304.9695 364.3933 395.0694 417.5508 448.1967 471.4967 477.0130 496.6414 525.5249 539.3622 573.9453 616.8240 654.2787 705.7068 733.5830 742.0452 784.8996 787.9398 798.7293 809.7488 815.6787 848.9466 873.1740 887.9541 913.2869 931.4652 951.8710 961.6499 981.3765 988.9532 990.9191 1019.2095 1032.8368 1059.2128 1062.7393 1085.1561 1092.2399 1101.0509 1114.7715 1147.4794 1165.0272 1175.1113 1188.5500 1209.3183 1234.2767 1235.7404 1257.0018 1259.5101 1271.8600 1283.9497 1291.1299 1328.5026 1329.3966 1336.1479 1350.5676 1356.1723 1383.3826 1389.9094 1403.9165 1414.9584 1439.5230 1454.3771 1455.2905 1468.4669 1473.1518 1477.1734 1483.9181 1491.9066 1516.3392 1587.5523 1597.7714 1630.2816 1639.9128 2955.6634 2958.3542 2967.4726 2970.0178 2972.4870 2987.5751 2998.2363 3006.4420 3037.7177 3049.4750 3068.9476 3070.9760 3118.9014 3120.0641 3130.1869 3134.1437 3147.9965 3154.4398 3162.7970 3476.9272 3606.7159
redmass: 4.5081 3.7154 2.8974 1.6775 3.0880 2.5306 2.2062 3.3484 3.9012 3.3840 1.2015 2.6635 2.6224 1.2348 3.8022 2.3250 3.6136 3.1535 2.8070 3.0152 2.8130 2.8711 4.3967 2.6641 3.1210 4.2398 3.4615 2.6849 1.1520 1.2885 5.0507 1.9591 1.3687 1.6356 1.7270 2.2875 1.7352 1.9675 1.4774 1.4237 1.7424 1.5593 1.3778 2.7104 1.7086 3.2624 2.2947 1.5014 2.0569 1.9400 2.3909 3.7063 1.9183 1.4986 1.5931 1.1299 1.3683 1.4880 1.8273 1.7998 1.5900 1.4260 1.4002 1.2523 1.0811 1.2016 1.2938 1.2911 1.5249 1.5914 1.8699 1.2167 2.8289 4.4724 2.5227 1.7951 1.2669 1.0654 1.0811 1.0421 1.0734 1.0961 3.7101 7.4195 5.1723 6.4320 1.0937 1.0588 1.0596 1.0660 1.0769 1.0363 1.0631 1.0930 1.1003 1.1030 1.1046 1.1004 1.0995 1.0859 1.0853 1.0883 1.0910 1.0939 1.0988 1.0997 1.0444 1.0985
irintensity: 0.0159 0.0270 0.9416 0.1099 0.7487 1.2296 1.5274 1.9166 1.8630 0.1228 0.4555 3.5869 0.7298 37.6005 4.0964 19.5748 4.3633 8.9294 17.7661 14.2091 56.7780 123.9122 71.5457 132.1527 7.1401 19.6100 1.0089 5.4668 9.0378 6.1222 2.5711 82.8120 3.9884 47.6654 4.5751 1.8980 3.6962 9.7479 5.0033 6.6232 18.5225 1.2757 1.5742 14.5825 11.9324 1.4321 7.9688 5.1988 4.3083 4.1806 5.9154 27.9594 12.3061 4.8533 0.5834 1.3571 0.2737 0.9950 2.7042 2.1141 0.0444 4.3644 6.3054 1.6193 1.1022 8.5077 0.7082 1.0766 2.8218 1.5329 10.6232 11.7422 3.1788 8.7774 5.3383 1.4392 8.6788 0.2953 2.7264 12.4677 0.9260 20.5037 10.3738 9.6585 7.0069 0.3060 36.1995 13.2300 5.6527 59.8064 32.4038 39.3878 23.8634 27.2922 7.4519 58.4271 30.2078 74.9222 60.0702 1.9097 0.4133 5.1644 24.5986 41.0538 39.0523 25.5226 3.3298 0.9897
temp: 298.150 k
press: 1.00000 atm
elementType: 7 6 6 6 6 6 6 6 6 6 6 6 6 6 6 6 6 1 1 1 1 1 1 1 1 1 1 1 1 1 1 1 1 1 1 1 1 1
symmnumber: 1
zpe: 862930.6 jmol-1
zpe.correction: 0.328673 hartree
zpe.thermalcorrener: 0.345639 hartree
zpe.thermalcorrenthalpy: 0.346583 hartree
zpe.thermalcorrgfe: 0.283178 hartree
zpe.sumelectzpe: -675.793307 hartree
zpe.sumelectthermal: -675.776341 hartree
zpe.sumelectthermalent: -675.775397 hartree
zpe.sumelectthermalfe: -675.838803 hartree
dipole: 0.9056 -0.2363 -0.8577
dipole: 1.2695
quadrupole: -94.8872 -105.3525 -102.8491
quadrupole: 4.9001 3.2215 -11.1760
quadrupole: 6.1424 -4.3229 -1.8195 4.9001 3.2215 -11.1760
hfenergy: -676.1219802 hartree
pointgroup: C01 [X(C16H21N1)]
dipole: 0.3119488 0.3592606 0.1519076 debye
polarizability: 228.2143774|-14.4511453|123.7952795|-12.7683286|-11.1888684|196.8505526 unknown
InChI: InChI=1S/C16H21N/c1-2-3-7-14(12-17)16-11-6-9-13-8-4-5-10-15(13)16/h4-6,8-11,14H,2-3,7,12,17H2,1H3
charge 0 multiplicity 1
38 atoms
N  2.1861 -2.77895 1.78329
C  1.188045 -0.709441 0.573192
C  2.551197 -0.210995 0.030405
C  -0.019425 -0.365812 -0.301387
C  2.673967 1.326113 -0.072213
C  1.211898 -2.273744 0.809044
C  -1.33095 -0.160013 0.287403
C  4.058891 1.787662 -0.580603
C  0.094527 -0.33215 -1.699954
C  -2.470943 0.093765 -0.577675
C  -1.568009 -0.199531 1.70496
C  -1.027894 -0.08966 -2.54849
C  -2.290892 0.124403 -1.998971
C  4.182187 3.323647 -0.677643
C  -3.767005 0.305356 0.000746
C  -2.841628 0.007948 2.240652
C  -3.955678 0.265328 1.382461
H  1.058268 -0.238948 1.569603
H  3.344017 -0.582474 0.713626
H  2.764251 -0.669339 -0.957847
H  2.481687 1.77439 0.925236
H  1.886292 1.719478 -0.744613
H  0.203423 -2.596974 1.128112
H  1.404467 -2.763559 -0.165277
H  4.249152 1.336922 -1.57652
H  4.847375 1.393632 0.093521
H  1.072931 -0.489394 -2.166387
H  -0.735556 -0.395488 2.387752
H  -0.886786 -0.071211 -3.634954
H  -3.158475 0.314835 -2.641903
H  2.022373 -2.499034 2.753834
H  3.16832 -2.70436 1.509485
H  3.423081 3.738402 -1.367361
H  5.178419 3.629081 -1.047309
H  4.02845 3.796592 0.310729
H  -4.613484 0.498812 -0.669444
H  -2.990609 -0.026527 3.325706
H  -4.950083 0.427639 1.812591
