program: Gaussian 09
title: 000298991
version: EM64L-G09RevD.01
frameworkgroup: C1[X(C21H16N2O)]
method: RPBEPBE
basis: SDD
operation: Freq
keyword: #p
keyword: freq=noraman
keyword: PBEPBE/SDD
title: #p freq=noraman PBEPBE/SDD
converged: YES YES NO NO
title: Mulliken charges:
elementType: O N N C C C C C C C C C C C C C C C C C C C C C H H H H H H H H H H H H H H H H
charge: -0.249662 -0.438449 -0.033300 0.158436 0.277083 0.386030 0.209667 -0.394635 -0.386373 -0.458362 -0.436013 0.506344 -0.248681 -0.420342 -0.257422 -0.246827 -0.429621 -0.317933 0.484169 -0.376419 -0.483102 -0.311306 0.217776 -0.798797 0.250627 0.267109 0.241822 0.239102 0.263276 0.232024 0.230325 0.230999 0.233601 0.257845 0.311912 0.224060 0.314861 0.239947 0.271458 0.238773
chargesum: 0.00000
title: Mulliken charges with hydrogens summed into heavy atoms:
elementType: O N N C C C C C C C C C C C C C C C C C C C C C
charge: -0.249662 -0.123587 -0.033300 0.158436 0.277083 0.386030 0.209667 -0.144008 -0.119264 -0.216539 -0.196911 0.506344 -0.016657 -0.157067 -0.027097 -0.015828 -0.196020 -0.060088 0.484169 -0.064507 -0.259043 -0.311306 0.217776 -0.048619
polarizability: 4.88760252e+02 -1.57475159e+01 2.68914560e+02 1.72926982e+01 5.68118009e-01 1.35436237e+02
1716.lowfreq: -70.1322 -3.8397 -1.9224 -0.0004 0.0005 0.0007 3.8394 24.0051 31.5354
frequency: -70.1309 23.9969 31.4764 40.7770 42.3122 74.4436 77.6982 100.9357 137.2405 138.2891 164.4148 165.6150 177.8799 244.6636 253.1040 292.6329 311.7003 345.3574 359.9592 391.4199 416.5153 425.1014 432.3211 446.3168 470.9426 502.5062 514.9841 527.4681 539.2141 561.9688 583.6812 621.7426 628.1430 642.0879 655.5780 662.7333 674.3743 744.5268 749.1460 760.2507 770.7572 784.9958 788.0886 815.9146 824.0614 835.7070 846.6513 859.5774 881.8507 920.2962 929.4805 940.9970 951.5148 968.9283 970.7844 984.8942 987.2919 995.4124 998.6553 1005.7711 1029.1465 1032.3799 1072.4216 1101.2014 1133.4635 1153.3665 1175.7123 1191.2465 1199.9505 1220.5291 1226.4058 1236.2082 1259.3348 1272.5673 1285.8795 1316.4236 1339.2277 1371.5435 1378.5364 1388.5455 1402.6373 1409.6541 1427.1227 1441.1350 1448.5698 1453.7845 1468.0041 1492.4462 1508.2350 1515.1532 1576.8739 1581.2798 1586.4055 1595.1926 1621.3240 1628.7470 1637.6405 2143.5275 2988.1021 3072.8959 3109.0665 3115.9788 3122.8653 3126.4455 3127.2940 3135.6469 3137.7457 3138.3272 3153.9080 3161.5121 3167.7378 3186.8033 3198.1421 3518.1157
redmass: 1.0458 5.6148 4.1065 7.9587 5.5492 4.1632 5.2045 5.1977 9.3642 5.1360 4.6073 7.0692 4.1177 4.1456 4.8999 5.5720 6.3280 5.5522 4.6260 3.8038 3.2494 3.5144 4.3741 7.1007 3.3021 5.5798 3.6133 7.1432 3.3863 3.5102 2.9082 4.6327 6.2857 5.4571 1.1808 5.7062 4.4109 3.3877 1.4090 6.0079 4.8362 4.3460 2.2412 1.6516 4.2684 1.3849 4.4952 1.4693 1.6629 1.4262 6.5328 1.7933 3.0280 1.3621 1.3822 1.7405 1.3710 1.3382 1.3434 2.5634 2.5419 1.6630 2.3797 2.5612 1.4417 1.3831 1.0996 1.3503 1.2299 2.9329 1.8120 1.9086 1.7684 2.0076 2.4762 1.6741 2.2364 3.3354 1.2418 1.8090 2.5011 6.1819 3.4375 2.3705 1.2041 2.4092 1.0465 2.0347 2.6506 3.8371 4.7682 6.7669 5.4493 5.7864 5.7175 6.4800 5.3128 12.6317 1.0385 1.0983 1.0884 1.0906 1.0866 1.0866 1.0908 1.0890 1.0979 1.0914 1.0944 1.0992 1.0993 1.0932 1.0946 1.0764
irintensity: 0.0343 0.1990 4.4359 4.6375 1.3336 5.7075 1.1325 3.2769 0.8179 0.2782 0.8064 4.8653 2.6054 2.4534 0.8771 1.0694 2.2189 11.7409 0.8997 0.8193 0.3756 5.2083 0.4715 0.3337 0.6964 0.4880 20.6881 0.3675 20.0881 11.3880 1.2080 7.3980 2.6237 14.0890 61.2860 5.9917 8.5404 1.2542 0.8124 0.7208 4.8428 8.7880 61.2159 59.1683 0.5808 29.9487 0.3514 49.4497 5.2464 1.3125 8.6978 22.9195 7.0397 0.6198 0.3632 50.5004 1.3772 2.0437 0.3331 7.1837 7.6456 8.1988 3.0704 1.5266 12.3178 1.7660 3.9348 5.0257 44.6695 170.7148 5.5168 3.5158 13.4320 53.3417 22.7681 80.9738 233.8962 9.0427 66.2290 17.2656 8.5534 1.8455 66.6193 13.3163 78.9933 0.5319 20.3247 557.9292 150.7108 10.5457 28.2063 55.9975 39.5421 44.9006 120.9250 0.8804 121.1887 55.7218 7.8128 13.7179 16.7039 26.6083 1.5040 0.8310 8.7095 9.2204 7.9345 17.5432 29.9702 33.7647 18.2509 3.2963 3.7181 15.8665
temp: 298.150 k
press: 1.00000 atm
elementType: 8 7 7 6 6 6 6 6 6 6 6 6 6 6 6 6 6 6 6 6 6 6 6 6 1 1 1 1 1 1 1 1 1 1 1 1 1 1 1 1
symmnumber: 1
zpe: 812130.1 jmol-1
zpe.correction: 0.309324 hartree
zpe.thermalcorrener: 0.329121 hartree
zpe.thermalcorrenthalpy: 0.330065 hartree
zpe.thermalcorrgfe: 0.258956 hartree
zpe.sumelectzpe: -992.937395 hartree
zpe.sumelectthermal: -992.917598 hartree
zpe.sumelectthermalent: -992.916654 hartree
zpe.sumelectthermalfe: -992.987764 hartree
dipole: 1.9490 -0.7020 0.1796
dipole: 2.0794
quadrupole: -97.2610 -147.8123 -144.3455
quadrupole: 23.6247 17.2583 -8.7916
quadrupole: 32.5453 -18.0060 -14.5393 23.6247 17.2583 -8.7916
hfenergy: -993.2467194 hartree
pointgroup: C01 [X(C21H16N2O1)]
dipole: 0.7430735 -0.271122 -0.2088236 debye
polarizability: 483.3187315|-44.9629579|182.1316545|-5.3671449|63.0080417|227.6606624 unknown
InChI: InChI=1S/C21H16N2O/c1-15(24)23-19-11-9-16(10-12-19)13-18(14-22)21-8-4-6-17-5-2-3-7-20(17)21/h2-13,23H,1H3
charge 0 multiplicity 1
40 atoms
O  6.041907 -0.86002 -2.158635
N  5.506342 -0.529883 0.10517
N  -0.543077 0.995642 3.543351
C  -3.304182 -0.148946 -0.201503
C  -2.582763 0.756715 0.675489
C  -4.673321 0.17838 -0.563303
C  -1.131764 0.572377 1.007761
C  -3.255002 1.865014 1.220728
C  -2.759383 -1.385798 -0.68982
C  -5.296553 1.347605 -0.017319
C  -5.398345 -0.692355 -1.443941
C  1.265121 0.082695 0.126477
C  -4.605266 2.163389 0.878913
C  -0.181345 0.282878 0.041234
C  -3.497563 -2.223094 -1.529969
C  -4.822948 -1.866179 -1.930332
C  1.963429 -0.152596 -1.097633
C  2.040297 0.09805 1.327444
C  4.102334 -0.334685 0.055385
C  3.351521 -0.357958 -1.152282
C  3.425926 -0.105954 1.288072
C  -0.786179 0.798192 2.386017
C  6.399199 -0.774941 -0.949532
C  7.850903 -0.928932 -0.497623
H  -2.718212 2.532648 1.903829
H  -1.76024 -1.694356 -0.369431
H  -6.329064 1.580478 -0.303193
H  -6.425533 -0.422788 -1.717382
H  -0.577921 0.209714 -0.980724
H  -5.08666 3.046139 1.312424
H  -3.063021 -3.167285 -1.876259
H  -5.387086 -2.525615 -2.598651
H  1.39389 -0.17202 -2.035186
H  1.563615 0.269793 2.294792
H  3.864093 -0.53478 -2.098727
H  3.996014 -0.088028 2.226133
H  5.920541 -0.484432 1.040016
H  8.217391 -0.009647 -0.004033
H  8.473761 -1.126571 -1.381386
H  7.964943 -1.769151 0.21233
