program: Gaussian 09
title: 000298981
version: EM64L-G09RevD.01
frameworkgroup: C1[X(C20H15NO)]
method: RPBEPBE
basis: SDD
operation: Freq
keyword: #p
keyword: freq=noraman
keyword: PBEPBE/SDD
title: #p freq=noraman PBEPBE/SDD
converged: YES YES NO NO
title: Mulliken charges:
elementType: O N C C C C C C C C C C C C C C C C C C C C H H H H H H H H H H H H H H H
charge: -0.254764 -0.030944 0.176386 0.261086 0.386758 0.201245 -0.416408 -0.372772 -0.450971 -0.431022 -0.248273 -0.400556 0.480552 -0.257620 -0.243935 -0.314941 -0.419245 0.322320 -0.379090 -0.378484 -0.296874 -0.536076 0.252583 0.252054 0.240368 0.237314 0.229545 0.239736 0.231022 0.229748 0.260133 0.228699 0.257448 0.244392 0.250567 0.224845 0.225174
chargesum: 0.00000
title: Mulliken charges with hydrogens summed into heavy atoms:
elementType: O N C C C C C C C C C C C C C C C C C C C C
charge: -0.254764 -0.030944 0.176386 0.261086 0.386758 0.201245 -0.163825 -0.120718 -0.210603 -0.193708 -0.018728 -0.160820 0.480552 -0.026599 -0.014187 -0.054808 -0.190547 0.322320 -0.121642 -0.134091 -0.296874 0.164510
polarizability: 4.39782263e+02 1.03701100e+01 2.26382422e+02 -3.58918067e+00 -6.96863485e-01 1.32666997e+02
1716.lowfreq: -5.2185 -2.1798 0.0005 0.0006 0.0006 5.5595 22.2012 37.8646 47.7085
frequency: 22.0673 37.8465 47.6914 51.3031 95.0583 114.2818 131.1357 144.8506 164.0940 177.8917 194.0879 216.9556 250.0826 263.5027 314.4639 342.3035 380.2493 414.9182 416.7053 423.7817 433.9143 455.9920 473.1231 506.1863 513.6947 533.6734 538.1915 574.3327 623.8332 636.1538 652.6975 668.6992 721.0761 737.7755 747.1689 750.6779 784.7734 791.3183 800.3161 809.2667 814.2453 844.4599 853.6784 880.5290 913.4207 922.9867 953.5411 955.7360 964.4608 980.9952 983.0805 984.0302 995.1717 999.1787 1027.2330 1060.6245 1101.1187 1110.8475 1124.6029 1152.5749 1158.6605 1176.9374 1184.1439 1188.0542 1226.8961 1235.8180 1248.0911 1260.9359 1285.3015 1314.4459 1343.3849 1366.6755 1392.8294 1403.8910 1413.7893 1434.9643 1435.6989 1439.8724 1453.0254 1468.6358 1471.2113 1499.9530 1516.3281 1561.9192 1579.5270 1591.3925 1592.9493 1619.1852 1630.2712 2142.0318 2965.8693 3056.8865 3099.1695 3121.5597 3122.5571 3124.2953 3132.0786 3136.5824 3137.3655 3154.7146 3159.2209 3162.9413 3164.2866 3170.3477 3189.5713
redmass: 5.2755 4.0544 5.0602 5.4377 4.5481 5.2502 5.3061 6.4629 5.9067 4.2151 3.3251 1.9151 2.2215 2.8352 5.8637 5.5108 4.1447 5.2690 3.1749 4.1452 4.4194 5.0171 3.3436 5.4923 3.9624 5.6256 3.1676 3.8790 6.8287 4.6351 6.3917 4.4980 4.4358 3.4573 1.5186 4.8228 3.0607 2.5859 5.6939 1.3506 1.5975 1.5055 4.1110 1.7730 1.4248 1.4066 1.8582 2.7406 1.4257 1.3654 7.7327 1.3912 1.3489 2.6304 2.7110 2.4391 2.3213 1.2594 1.4311 1.3886 1.3225 1.1083 1.3024 1.2839 2.0480 1.8127 2.9982 1.9283 2.0660 1.4200 2.3915 2.7503 2.3696 2.5474 6.3844 2.5411 1.3991 2.4794 2.4429 1.0514 1.0764 2.4139 3.7416 6.9132 6.7753 6.7474 5.5053 6.1982 6.4682 12.6267 1.0327 1.1043 1.0878 1.0869 1.0892 1.0861 1.0999 1.0914 1.0895 1.0949 1.0991 1.0901 1.0934 1.0986 1.0952
irintensity: 1.2640 0.0942 0.6587 0.1341 3.8941 2.1752 3.0404 3.7900 0.4954 2.7994 2.3868 1.3068 1.8738 2.1775 1.7591 0.7356 0.6190 7.1422 1.0886 5.9934 3.7173 4.3349 0.8108 5.0612 17.3731 26.1382 14.3329 9.8816 3.0719 2.6755 1.7652 5.1068 0.9948 1.2095 3.8440 0.9685 28.9184 47.9119 7.5466 11.1779 62.0082 49.7781 1.4108 5.4776 6.4619 7.9570 3.7175 5.1798 2.1437 0.8302 64.6292 4.0636 0.4530 11.5013 8.3955 3.9092 4.2980 0.1834 9.6562 0.2563 3.6528 9.9482 221.4049 1.0998 2.3825 3.9862 253.9951 47.5796 3.6225 0.8999 17.4062 5.7376 19.2949 1.2428 0.3804 47.2210 1.6151 9.1055 1.2240 16.7447 57.4406 147.3855 10.0920 44.4585 21.2201 65.0746 6.3507 205.1177 0.1124 57.7929 92.5177 43.4298 15.4274 2.1621 15.1455 0.8657 21.7740 8.3512 20.1153 39.6031 30.3542 3.3196 17.8353 15.6086 4.9881
temp: 298.150 k
press: 1.00000 atm
elementType: 8 7 6 6 6 6 6 6 6 6 6 6 6 6 6 6 6 6 6 6 6 6 1 1 1 1 1 1 1 1 1 1 1 1 1 1 1
symmnumber: 1
zpe: 754322.8 jmol-1
zpe.correction: 0.287306 hartree
zpe.thermalcorrener: 0.305742 hartree
zpe.thermalcorrenthalpy: 0.306686 hartree
zpe.thermalcorrgfe: 0.239354 hartree
zpe.sumelectzpe: -899.580156 hartree
zpe.sumelectthermal: -899.561721 hartree
zpe.sumelectthermalent: -899.560777 hartree
zpe.sumelectthermalfe: -899.628109 hartree
dipole: 2.4444 4.2676 -3.3539
dipole: 5.9528
quadrupole: -88.4441 -123.4672 -134.5896
quadrupole: 6.2580 -4.6636 5.9575
quadrupole: 27.0562 -7.9669 -19.0893 6.2580 -4.6636 5.9575
hfenergy: -899.8674628 hartree
pointgroup: C01 [X(C20H15N1O1)]
dipole: 0.9071619 -0.4586602 -2.1099205 debye
polarizability: 439.1157524|-2.9026498|150.2236059|-16.7234375|-36.3784201|209.4923232 unknown
InChI: InChI=1S/C20H15NO/c1-22-18-11-9-15(10-12-18)13-17(14-21)20-8-4-6-16-5-2-3-7-19(16)20/h2-13H,1H3
charge 0 multiplicity 1
37 atoms
O  6.29765 -0.478547 0.333214
N  -0.21625 0.582832 2.912849
C  -2.929762 -0.240788 0.166731
C  -1.777482 0.509727 -0.290065
C  -4.222713 0.026626 -0.437604
C  -0.407742 0.320062 0.29663
C  -1.934486 1.453606 -1.319495
C  -2.849064 -1.265384 1.168621
C  -4.331924 1.003479 -1.481315
C  -5.372555 -0.707041 0.006452
C  -3.20481 1.697056 -1.921969
C  0.681091 0.103699 -0.532749
C  2.111535 -0.033402 -0.25749
C  -3.986188 -1.966521 1.577284
C  -5.262398 -1.682001 0.998829
C  2.728544 0.083589 1.030045
C  2.962357 -0.30668 -1.36938
C  4.934896 -0.344906 0.058528
C  4.111859 -0.069584 1.183603
C  4.353823 -0.463188 -1.230396
C  -0.286942 0.449189 1.723233
C  7.19919 -0.766167 -0.788208
H  -1.067287 2.042349 -1.638141
H  -1.881146 -1.508669 1.616105
H  -5.315267 1.196237 -1.926516
H  -6.343836 -0.490836 -0.45457
H  -3.288948 2.446873 -2.715801
H  0.41948 0.003606 -1.59645
H  -3.900576 -2.742363 2.345764
H  -6.146611 -2.236442 1.331625
H  2.12461 0.296859 1.914734
H  2.516835 -0.400393 -2.367615
H  4.584999 0.019701 2.165965
H  4.965889 -0.672793 -2.112342
H  8.200842 -0.83007 -0.339604
H  7.176022 0.047161 -1.538645
H  6.942665 -1.728774 -1.270756
