program: Gaussian 09
title: 000298949
version: EM64L-G09RevD.01
frameworkgroup: C1[X(C11H8N2O3)]
method: RPBEPBE
basis: SDD
operation: Freq
keyword: #p
keyword: freq=noraman
keyword: PBEPBE/SDD
title: #p freq=noraman PBEPBE/SDD
converged: NO YES NO NO
title: Mulliken charges:
elementType: O O O N N C C C C C C C C C C C H H H H H H H H
charge: -0.249032 -0.203265 -0.204552 0.024386 -0.015640 0.189295 0.279331 0.231897 0.096759 -0.492391 -0.352576 -0.508108 0.412559 -0.373732 -0.660268 -0.233969 0.241395 0.245062 0.269072 0.312988 0.291289 0.228441 0.233470 0.237588
chargesum: 0.00000
title: Mulliken charges with hydrogens summed into heavy atoms:
elementType: O O O N N C C C C C C C C C C C
charge: -0.249032 -0.203265 -0.204552 0.024386 -0.015640 0.189295 0.279331 0.231897 0.096759 -0.005935 -0.083503 -0.195119 0.412559 -0.082444 0.039232 -0.233969
polarizability: 2.41612433e+02 6.82806558e+00 1.59340636e+02 -4.01912609e+00 6.64174490e+00 6.57717718e+01
1716.lowfreq: -0.0008 -0.0003 0.0005 1.4785 3.4892 6.9474 37.9137 58.0612 63.5385
frequency: 37.9091 58.0553 63.5352 96.9134 101.5909 149.6776 167.8876 207.6080 233.3422 276.2331 290.3202 320.5287 374.7863 402.1479 440.6044 491.4016 504.8377 525.7416 547.9018 569.4288 604.9895 670.7770 683.3071 698.0091 701.5477 760.2158 764.5168 787.9456 854.4262 880.9193 904.9672 920.1437 976.6061 991.3783 1024.6465 1050.7983 1061.3498 1106.9988 1137.7720 1157.3712 1207.1563 1223.1626 1252.5300 1279.4400 1310.6524 1356.3894 1364.8312 1393.9976 1415.3984 1443.4209 1458.4633 1469.4990 1475.7393 1485.1352 1571.3741 1594.9036 1626.4266 2188.1128 2998.3956 2998.6198 3065.5686 3100.4945 3107.0201 3165.8230 3191.2724 3196.8925
redmass: 2.7743 8.8773 7.9714 4.7694 10.4086 2.6915 3.4389 2.0047 3.7588 2.9763 7.8674 7.1941 5.2357 6.6503 3.2989 8.4111 6.6937 7.2155 7.1925 5.7771 4.9197 6.4208 7.7601 6.4965 5.2080 4.8253 8.5353 1.3512 1.4683 4.3412 5.2206 1.4458 2.4782 1.3326 2.7480 2.0459 1.8358 2.3738 2.6279 1.9394 4.4478 3.3913 1.4065 1.6161 1.4627 3.8741 9.0880 1.2377 4.3620 6.7525 1.0901 4.2106 1.0431 1.0680 8.8532 8.7700 8.3974 12.6065 1.0598 1.0377 1.0984 1.1010 1.1015 1.0908 1.0955 1.0941
irintensity: 0.0171 0.1234 2.2714 4.2927 5.1845 0.2781 0.0466 0.8120 0.8585 2.8454 3.1737 0.8355 0.4939 0.1816 5.4817 0.2200 3.8168 1.2392 3.5452 0.3810 0.4395 3.2345 10.9363 4.5951 21.9193 2.3265 20.0083 4.9730 31.0838 2.5596 10.5229 35.8731 14.5045 0.7782 44.5208 2.2623 26.4487 6.4462 1.7523 37.1889 279.4572 241.3091 9.8218 5.1256 7.6325 23.4700 77.7647 6.8409 83.0357 25.4982 11.2377 5.3965 15.0287 11.4937 62.2840 2.7790 44.2620 47.2320 8.5959 30.3989 1.7749 30.3332 23.4998 1.3184 1.9348 10.6506
temp: 298.150 k
press: 1.00000 atm
elementType: 8 8 8 7 7 6 6 6 6 6 6 6 6 6 6 6 1 1 1 1 1 1 1 1
symmnumber: 1
zpe: 445847.3 jmol-1
zpe.correction: 0.169814 hartree
zpe.thermalcorrener: 0.183627 hartree
zpe.thermalcorrenthalpy: 0.184572 hartree
zpe.thermalcorrgfe: 0.127990 hartree
zpe.sumelectzpe: -757.928701 hartree
zpe.sumelectthermal: -757.914888 hartree
zpe.sumelectthermalent: -757.913943 hartree
zpe.sumelectthermalfe: -757.970525 hartree
dipole: 4.0832 -1.8911 -0.1897
dipole: 4.5038
quadrupole: -114.8011 -97.2162 -91.1421
quadrupole: -20.2231 -0.5957 0.2311
quadrupole: -13.7480 3.8369 9.9110 -20.2231 -0.5957 0.2311
hfenergy: -758.0985149 hartree
pointgroup: C01 [X(C11H8N2O3)]
dipole: -1.5789212 -0.8037204 0.0286597 debye
dipolederiv: -0.8858036 0.2070351 0.034113 -0.0366856 -0.5807969 0.0116677 0.0488922 -0.0044269 -0.1496098 -0.938033 -0.1790507 0.0436133 -0.2580397 -0.5757286 0.0215345 0.0525783 0.0186863 -0.2267059 -0.7200105 0.1785223 0.0243587 0.3618742 -0.7352455 -0.0080558 0.0260409 -0.0024614 -0.2290126 2.1747662 -0.0972326 -0.1114551 -0.2746742 1.0923 -0.0050726 -0.1267411 -0.0105065 0.1938468 -0.3372513 0.1020067 0.0103103 0.1717258 -0.3450117 -0.0169298 0.0045189 -0.005111 -0.2325385 0.7584121 0.0909234 -0.0476691 -0.0786507 -0.1455544 -0.0001574 -0.0453002 0.0016233 0.0392342 0.6633013 0.0712464 0.015258 0.2387543 0.8605823 -0.0115047 -0.0507188 -0.0350801 0.025898 0.1053825 0.1033469 -0.0148457 0.7187523 0.1086028 -0.0445559 -0.0137377 -0.0100036 0.0724347 -0.4283745 -0.077586 0.0110942 -0.1956233 -0.3417776 -0.0074537 0.0415075 0.0141491 0.037717 -0.0529042 -0.0365576 -0.0109243 -0.2563431 -0.0752592 -0.0425473 -0.0954355 -0.0994544 0.0539965 -0.3131477 -0.0783715 0.0120443 -0.1032224 0.1494526 0.0044045 0.0154886 0.0011684 -0.120306 0.3736327 -0.0933635 -0.0179827 0.1422763 -0.0895652 -0.009543 -0.0364478 0.0074235 -0.1064504 -1.0006347 0.0941042 0.0508699 0.1172365 0.0375811 -0.0111095 0.06704 -0.0064219 0.0384922 0.1498165 0.0650032 -0.0201676 -0.2507732 -0.0027251 0.0140791 -0.0136049 -0.006792 -0.1172556 -0.0366043 -0.0657424 -0.0034939 0.0546895 0.0898052 -0.0208885 0.1591297 0.0756796 0.0533989 0.17324 -0.2891327 -0.0114175 -0.3740428 0.3491252 0.0327694 -0.0040877 0.014007 0.0317157 0.0186289 -0.0411042 -0.0332535 -0.0309918 0.0284308 0.0915228 -0.0019775 0.0732181 -0.0419861 0.0000252 0.0378825 0.0212355 0.0849222 -0.0234255 -0.060632 -0.0013729 -0.0369327 0.0820543 0.0718567 0.0526456 0.0053873 0.0302178 -0.0068752 0.0010315 0.0056759 -0.0006954 0.1603335 0.1402796 0.0173006 0.0029958 -0.0095958 0.0963729 0.0017841 0.0040242 0.0000556 0.1919043 0.0832345 -0.0642831 0.006849 -0.0165785 0.0910187 0.0029148 0.0061888 0.005744 0.1742979 0.1163421 0.0051881 -0.0019001 0.0239312 0.000318 0.1178654 -0.0306368 0.0566866 -0.0711611 -0.1272176 -0.1391843 0.0073483 -0.1530059 0.0110529 -0.016634 -0.0124039 -0.0287558 0.0722144 0.0110632 0.1364036 0.0276318 0.093847 0.0073223 -0.0444896 0.0013799 -0.0217997 0.0674877 unknown
polarizability: 241.7750648|-3.4971449|159.4069417|-7.4359723|2.1264476|65.5428337 unknown
InChI: InChI=1S/C11H8N2O3/c1-2-10-9(6-12)8-4-3-7(13(14)15)5-11(8)16-10/h3-5H,2H2,1H3
charge 0 multiplicity 1
24 atoms
O  -1.035575 -1.511713 0.181723
O  4.611774 0.702073 -0.233737
O  4.11195 -1.523385 -0.158283
N  3.772631 -0.276491 -0.159023
N  -3.480599 2.683099 0.271172
C  -0.376149 0.714554 0.097302
C  -2.187344 -0.700631 0.246954
C  0.07307 -0.637172 0.090748
C  -1.829417 0.650578 0.195994
C  -3.50113 -1.403246 0.326101
C  0.576187 1.759403 0.01559
C  1.410511 -1.020961 0.01093
C  2.329778 0.050133 -0.069463
C  1.937547 1.417365 -0.068548
C  -3.817941 -2.235377 -0.948558
C  -2.733143 1.749089 0.239286
H  -3.497915 -2.076201 1.205431
H  -4.288275 -0.6474 0.493909
H  0.263253 2.807391 0.01778
H  1.748996 -2.05885 0.008318
H  2.715152 2.182184 -0.134137
H  -3.876176 -1.588279 -1.840779
H  -4.788812 -2.746018 -0.828353
H  -3.042171 -3.000243 -1.122059
