program: Gaussian 09
title: 000299022
version: EM64L-G09RevD.01
frameworkgroup: C1[X(C22H22O2)]
method: RPBEPBE
basis: SDD
operation: Freq
keyword: #pfreq=noraman
keyword: PBEPBE/SDD
title: #p freq=noraman PBEPBE/SDD
converged: YES YES NO NO
title: Mulliken charges:
elementType: O O C C C C C C C C C C C C C C C C C C C C C C H H H H H H H H H H H H H H H H H H H H H H
charge: -0.267446 -0.225051 -0.339735 0.361894 0.386575 0.211666 -0.761848 0.173995 -0.422350 0.132288 0.156073 -0.423495 -0.392457 -0.362699 -0.399549 -0.348330 -0.280779 -0.256211 -0.237491 0.097956 -0.264879 -0.233402 -0.782733 -0.687607 0.268602 0.245959 0.221763 0.214421 0.243353 0.241697 0.252803 0.236432 0.270838 0.238178 0.224137 0.229992 0.226064 0.231521 0.206343 0.207086 0.242966 0.230706 0.262405 0.207011 0.231738 0.231605
chargesum: 0.00000
title: Mulliken charges with hydrogens summed into heavy atoms:
elementType: O O C C C C C C C C C C C C C C C C C C C C C C
charge: -0.267446 -0.225051 -0.071134 0.361894 0.386575 0.211666 -0.079705 0.173995 -0.178996 0.132288 0.156073 -0.181798 -0.139655 -0.126267 -0.128711 -0.110152 -0.056643 -0.026220 -0.011428 0.097956 -0.033358 0.180027 -0.046657 -0.017253
polarizability: 2.95023790e+02 3.58823498e+01 2.66123805e+02 2.18848087e+01 8.25933685e+00 1.89083414e+02
1716.lowfreq: -8.7009 -6.4464 -0.0004 0.0006 0.0007 4.1271 15.4940 22.2720 39.4828
frequency: 14.8960 22.2505 39.4341 40.7214 61.9726 93.0218 107.4458 108.9328 127.7510 140.8289 142.8864 156.2022 177.9981 195.8418 230.0463 242.5725 252.0200 258.2800 291.8020 301.2767 326.3243 341.1390 373.2330 401.7504 414.3207 430.0467 466.6270 479.4233 491.4313 502.5677 510.1683 543.7625 580.4575 594.7909 601.1653 624.1222 626.5843 653.6171 693.4845 705.1461 722.1857 768.0628 771.9460 777.1141 789.3024 793.0314 796.9353 812.9399 838.3466 869.4457 881.8295 886.4879 937.8672 947.0655 956.8025 968.0093 969.8945 991.7218 994.9473 996.2152 1017.1927 1021.4932 1034.9875 1036.9964 1047.1840 1064.1342 1071.1564 1080.2965 1116.5080 1135.5168 1137.0478 1156.0984 1176.8541 1178.5683 1182.0740 1204.6639 1234.1446 1242.4592 1251.6697 1259.9827 1262.6078 1279.6244 1284.0727 1321.9678 1362.1997 1365.3688 1368.4376 1378.4870 1385.0866 1390.1126 1400.3538 1418.6300 1431.0191 1438.5288 1448.1958 1455.7306 1460.3383 1461.9304 1471.1123 1473.3460 1478.4881 1489.7759 1492.8489 1520.3811 1568.9643 1586.4170 1595.7247 1597.4195 1606.5274 1628.5350 2952.8516 2976.6760 2986.9793 2996.1728 3010.4216 3042.2413 3074.4214 3076.9985 3080.6628 3093.5376 3104.7096 3124.4124 3126.7606 3128.3871 3130.4089 3142.9961 3144.9243 3158.3392 3163.2324 3164.4372 3168.8079 3174.1289
redmass: 3.6944 4.6234 5.8431 4.0493 4.5402 3.2352 2.0865 3.1951 3.8871 1.1397 3.4643 3.6974 4.3389 4.1211 4.0915 1.6165 2.2127 2.4129 1.3535 3.7061 3.3186 3.6241 6.5020 3.8592 3.3861 3.5613 3.7435 4.1062 4.5703 4.5248 3.7264 5.2602 4.1210 2.9294 5.0967 3.3072 3.6548 3.6570 3.4298 4.4283 4.8668 1.4621 3.6918 1.4185 2.8726 4.0013 2.9443 1.3272 1.1976 3.2141 1.7187 1.3963 1.3699 2.3258 1.4289 1.7420 2.0334 1.7229 1.3588 1.4642 1.8391 2.6073 2.6200 2.7685 2.0795 2.6591 3.9551 1.7396 2.1566 1.9622 1.4427 1.5222 1.2828 1.5079 1.0769 2.0438 2.6990 1.8403 3.4583 1.7505 1.1429 1.5782 1.5212 1.5676 1.6773 1.4884 2.1401 2.7103 1.5058 1.5269 1.3330 5.0526 2.1189 2.6081 1.1071 2.5058 1.0592 1.0401 1.1089 2.0939 1.0735 1.1025 1.0943 3.8036 5.5683 6.5544 8.0401 6.3684 5.9675 6.6409 1.0554 1.0357 1.0381 1.0361 1.1073 1.0833 1.0988 1.0950 1.0982 1.0989 1.1014 1.1003 1.0857 1.0855 1.0885 1.0896 1.0904 1.0936 1.0934 1.0944 1.0990 1.0977
irintensity: 0.7991 1.5347 4.6008 1.5606 0.9042 1.5130 2.7700 1.0758 0.3003 0.1413 0.6179 1.6071 3.0849 0.5342 1.7697 1.9112 0.3681 0.0950 0.5188 0.0268 1.2838 1.0272 0.5897 1.1134 1.5669 6.1999 1.8036 3.7798 2.0491 8.6539 0.4196 2.3667 14.1820 7.3321 13.4664 1.4119 1.9557 1.7527 7.2937 4.4105 9.4952 58.6271 6.5629 82.0619 4.9828 3.7284 0.5150 38.6155 6.0302 14.7286 0.5866 0.3693 0.9370 26.0568 1.2937 1.3060 3.8086 8.3382 1.0989 1.4540 6.0058 16.0110 13.6391 8.4438 47.6417 2.3001 165.7692 0.9182 8.0832 3.1408 4.3627 6.7890 4.5173 17.1647 0.4015 6.0687 166.2384 7.1691 143.1523 39.5039 0.6870 1.3653 4.7690 6.6065 22.8658 30.9576 38.1630 0.5759 24.5698 57.9900 13.0715 11.3497 6.1538 19.6785 25.4104 48.0977 20.0344 12.0488 19.6130 23.4368 7.4702 8.6890 3.1651 16.2964 38.2846 76.3435 81.3558 0.2067 45.6627 5.4303 38.3643 34.1914 3.5381 27.8495 34.5085 3.9171 34.8252 12.3887 26.0839 28.8335 33.7256 10.5877 5.2497 2.5957 12.0175 11.1761 25.1640 26.6942 19.9756 19.8205 23.5688 16.7171
temp: 298.150 k
press: 1.00000 atm
elementType: 8 8 6 6 6 6 6 6 6 6 6 6 6 6 6 6 6 6 6 6 6 6 6 6 1 1 1 1 1 1 1 1 1 1 1 1 1 1 1 1 1 1 1 1 1 1
symmnumber: 1
zpe: 986502.0 jmol-1
zpe.correction: 0.375739 hartree
zpe.thermalcorrener: 0.398090 hartree
zpe.thermalcorrenthalpy: 0.399034 hartree
zpe.thermalcorrgfe: 0.322576 hartree
zpe.sumelectzpe: -1000.282706 hartree
zpe.sumelectthermal: -1000.260355 hartree
zpe.sumelectthermalent: -1000.259411 hartree
zpe.sumelectthermalfe: -1000.335869 hartree
dipole: -0.9955 -4.1283 0.0280
dipole: 4.2467
quadrupole: -126.0408 -130.5964 -136.3749
quadrupole: 1.5066 0.4035 -3.0609
quadrupole: 4.9632 0.4076 -5.3708 1.5066 0.4035 -3.0609
hfenergy: -1000.6584448 hartree
pointgroup: C01 [X(C22H22O2)]
dipole: -0.3443824 -1.5952809 0.3577663 debye
polarizability: 293.8242874|40.0581796|268.0473338|11.285938|-8.8729527|188.3593889 unknown
InChI: InChI=1S/C22H22O2/c1-4-24-22-14-13-18(20-11-7-8-12-21(20)22)15(2)17-9-5-6-10-19(17)16(3)23/h5-15H,4H2,1-3H3
charge 0 multiplicity 1
46 atoms
O  4.003902 -1.070462 0.228282
O  -1.745315 2.042185 1.140357
C  -1.356295 0.567941 -1.324659
C  0.045433 0.146373 -0.837776
C  -2.462212 -0.268453 -0.662744
C  1.124835 1.109907 -0.746563
C  -1.39131 0.552461 -2.876943
C  2.457942 0.665605 -0.385223
C  0.326713 -1.194665 -0.557883
C  -2.794387 -0.116103 0.729505
C  2.683368 -0.73373 -0.111775
C  1.62948 -1.648799 -0.192971
C  -3.15225 -1.26211 -1.399467
C  0.939395 2.511833 -0.997312
C  3.529874 1.610988 -0.300046
C  -3.771427 -0.969111 1.312344
C  1.999825 3.416646 -0.910113
C  -4.138239 -2.087475 -0.813223
C  3.309102 2.964934 -0.562004
C  -2.188729 0.952229 1.607692
C  -4.449288 -1.94594 0.555453
C  4.300391 -2.487237 0.50815
C  -2.144531 0.716205 3.118758
C  5.788757 -2.572722 0.836141
H  -1.528521 1.605994 -0.99694
H  -0.632634 1.253962 -3.266144
H  -2.379043 0.867415 -3.262401
H  -1.150159 -0.44438 -3.289205
H  -0.479278 -1.934462 -0.617414
H  1.780768 -2.711947 0.013288
H  -2.916446 -1.396631 -2.458892
H  -0.05822 2.886909 -1.242164
H  4.522421 1.244931 -0.023629
H  -4.021634 -0.854173 2.371894
H  1.824441 4.481537 -1.099626
H  -4.652592 -2.839155 -1.422681
H  4.134907 3.681828 -0.49487
H  -5.207825 -2.581171 1.025175
H  3.678614 -2.8318 1.360299
H  4.046906 -3.098527 -0.382644
H  -1.82097 -0.309446 3.366796
H  -3.142337 0.876582 3.570714
H  -1.450438 1.44656 3.562214
H  6.069446 -3.618936 1.055881
H  6.395811 -2.218677 -0.014495
H  6.029642 -1.953211 1.71686
