program: Gaussian 09
title: 000298940
version: EM64L-G09RevD.01
frameworkgroup: C1[X(C11H9NO2)]
method: RPBEPBE
basis: SDD
operation: Freq
keyword: #p
keyword: freq=noraman
keyword: PBEPBE/SDD
title: #p freq=noraman PBEPBE/SDD
converged: NO YES NO NO
title: Mulliken charges:
elementType: O O N C C C C C C C C C C C H H H H H H H H H
charge: -0.246712 -0.434304 -0.022526 0.246140 0.177788 -0.509991 0.174190 0.141067 -0.529954 -0.314354 -0.674974 0.302919 -0.372323 -0.193108 0.234684 0.223110 0.268967 0.260080 0.227361 0.227180 0.231267 0.226091 0.357403
chargesum: 0.00000
title: Mulliken charges with hydrogens summed into heavy atoms:
elementType: O O N C C C C C C C C C C C
charge: -0.246712 -0.076901 -0.022526 0.246140 0.177788 -0.052197 0.174190 0.141067 -0.260987 -0.054274 0.010834 0.302919 -0.146232 -0.193108
polarizability: 2.18338266e+02 -7.21924484e+00 1.29400235e+02 -3.29423751e+00 -7.02326858e+00 6.35041799e+01
1716.lowfreq: -4.6773 0.0006 0.0008 0.0009 3.9377 10.2110 56.1317 73.7015 105.5650
frequency: 56.1024 73.6955 105.5622 122.2485 162.2077 180.6038 226.0080 248.2214 328.3691 334.0866 351.5436 392.7108 412.9018 425.1807 434.5555 496.2683 553.2146 561.0179 600.8602 620.3458 679.1803 696.6122 748.7977 766.7189 792.1708 793.2548 834.0649 870.0367 923.4706 939.7677 955.0473 1053.0457 1072.9909 1090.4856 1118.1796 1142.4385 1168.4554 1199.8330 1244.0682 1256.8315 1268.0301 1316.9856 1354.4845 1392.0931 1414.9093 1445.8990 1472.8030 1474.7649 1486.7673 1495.6573 1576.7333 1595.0278 1637.5172 2180.6099 2991.1065 2992.1483 3049.4912 3091.2307 3096.0756 3129.8412 3176.7405 3182.4107 3586.0143
redmass: 2.6561 9.0522 3.5907 7.6759 1.7547 6.1897 2.4389 1.9380 3.4855 1.3186 4.3768 9.6935 7.1372 3.4630 4.5175 5.9249 7.8716 4.3530 3.8733 5.5368 7.0473 5.4371 3.5667 2.6311 1.6101 2.3583 3.1379 1.5553 1.3317 3.1283 2.3215 2.7799 2.1059 2.1910 1.6554 1.5178 2.3589 1.9513 5.2238 1.3178 1.5120 1.3835 3.6031 1.2373 4.5835 3.8667 1.0681 1.0485 1.1679 3.1601 8.9692 7.6838 7.5417 12.6019 1.0384 1.0578 1.1003 1.1003 1.1014 1.0902 1.0932 1.0956 1.0663
irintensity: 0.2451 1.0311 1.8779 2.6997 1.5079 0.6215 3.2294 3.2025 48.4882 97.6138 5.9245 0.3843 1.9570 4.3326 1.4884 1.8490 0.3677 4.8544 12.4697 0.7457 3.2034 0.8693 1.8121 6.9393 53.0743 52.2034 1.5882 22.2003 1.7088 31.2604 14.2980 21.5707 9.5258 21.3877 1.7401 214.4403 40.5243 2.5046 3.9901 2.4101 40.9693 4.0410 42.0430 15.3529 76.0814 25.1902 5.5446 12.4314 11.8667 22.2011 14.4720 29.3457 23.1427 72.1855 32.4973 17.8940 3.8774 40.8292 28.6350 10.9967 2.0802 2.8124 52.3845
temp: 298.150 k
press: 1.00000 atm
elementType: 8 8 7 6 6 6 6 6 6 6 6 6 6 6 1 1 1 1 1 1 1 1 1
symmnumber: 1
zpe: 451222.4 jmol-1
zpe.correction: 0.171862 hartree
zpe.thermalcorrener: 0.184274 hartree
zpe.thermalcorrenthalpy: 0.185218 hartree
zpe.thermalcorrgfe: 0.133099 hartree
zpe.sumelectzpe: -628.758813 hartree
zpe.sumelectthermal: -628.746400 hartree
zpe.sumelectthermalent: -628.745456 hartree
zpe.sumelectthermalfe: -628.797575 hartree
dipole: -5.2668 1.2215 0.1820
dipole: 5.4096
quadrupole: -85.8059 -78.4224 -83.2052
quadrupole: 16.4682 -1.5661 -1.3600
quadrupole: -3.3280 4.0554 -0.7274 16.4682 -1.5661 -1.3600
hfenergy: -628.9306743 hartree
pointgroup: C01 [X(C11H9N1O2)]
dipole: 2.0723334 -0.4631961 0.1434485 debye
dipolederiv: -0.6018952 -0.1222936 -0.0215094 0.0879522 -0.6412014 -0.0347383 -0.0211238 -0.0848898 -0.120239 -1.3132258 0.4712138 0.0277288 0.7086363 -0.325654 0.0509791 0.0518023 0.0416428 -0.4137006 -0.5808442 0.1279776 -0.014331 0.0487717 -0.2339308 0.0047084 -0.0176499 0.0084662 -0.2318349 0.2651105 0.2637582 0.0209923 -0.0856516 0.2591092 0.004553 0.0166408 0.070724 -0.0911898 0.0785818 -0.2510663 -0.030762 0.0114495 -0.1262327 -0.008751 -0.0004427 -0.0364192 -0.0049627 0.0955846 0.0253838 -0.0049283 0.0017843 0.0033793 0.0382442 -0.0074941 0.1149893 0.0891776 0.2515681 -0.0944531 -0.0112225 -0.3124701 -0.0132244 -0.0200946 -0.0279666 -0.0167696 0.0402492 -0.2049328 0.2075469 0.003708 0.4083216 0.5869504 0.0871842 0.0338712 0.07524 0.1233386 -0.2120493 0.2170104 0.0325935 -0.142858 0.051333 0.0170128 -0.0198524 0.0461626 -0.1578865 0.2105562 0.1651166 0.0421764 0.0285214 0.0642483 0.0306331 0.0256449 0.0367924 -0.1239049 0.0681806 -0.0377186 -0.0060664 -0.0157195 0.0119972 0.0323489 -0.0175814 -0.059298 0.0213594 1.2152284 -0.5109073 -0.0169813 -0.8280978 0.2220358 -0.0186461 -0.0494202 -0.0089541 0.067244 -0.2886194 -0.0231374 -0.0037054 0.4363032 -0.0371654 0.0465018 0.0584041 0.0230001 -0.2007025 0.6444222 -0.2528216 0.0182478 -0.1529201 -0.0077375 -0.0230598 0.0196611 -0.0236563 0.0483828 -0.0947729 -0.0226228 -0.088553 0.0350829 0.0409937 0.0377794 -0.0412958 0.0154313 0.054147 0.0425011 0.0415162 0.1147625 0.0101408 -0.0071837 -0.055831 0.069191 -0.0577564 -0.0473919 0.111253 -0.0142422 -0.0099764 0.0126652 -0.0264134 -0.0236315 -0.0084238 -0.0282338 0.1628619 0.093918 0.0115311 -0.0031494 -0.015996 -0.0288063 -0.0302742 -0.0072142 -0.0287722 0.1744408 -0.1156438 0.0416975 -0.0869242 0.0107883 0.1115276 0.0144832 -0.051627 0.0040162 0.0450916 0.0587705 -0.1035224 -0.0126701 -0.1034234 -0.1811711 -0.0060631 -0.0197357 -0.0094047 0.0660078 0.0275808 0.0395099 0.0959301 0.0810883 0.053408 -0.0811876 0.0685239 -0.0227138 -0.0495508 -0.1111423 -0.0677375 -0.0259235 -0.0372101 0.0675888 -0.0176483 -0.023916 -0.0194879 0.1715165 0.3598698 -0.1117393 -0.0194364 -0.1871592 0.1561493 -0.0445025 -0.0299956 -0.0401092 0.3775465 unknown
polarizability: 218.1234882|-6.6145298|129.6562794|7.786268|4.9237961|63.4629134 unknown
InChI: InChI=1S/C11H9NO2/c1-2-8-9-5-7(13)3-4-10(9)14-11(8)6-12/h3-5,13H,2H2,1H3
charge 0 multiplicity 1
23 atoms
O  -0.855521 1.711478 0.072467
O  3.981655 -1.057427 -0.029967
N  -4.294847 1.039514 -0.258049
C  -1.016332 -0.600234 -0.272058
C  0.388011 -0.248451 -0.126788
C  -1.59465 -1.975555 -0.476318
C  0.441635 1.161336 0.079731
C  -1.721703 0.595123 -0.14471
C  1.59122 -0.994142 -0.163597
C  1.635665 1.872153 0.254929
C  -1.535694 -2.842977 0.812655
C  2.800327 -0.293124 0.011186
C  2.828731 1.120213 0.219127
C  -3.113263 0.854181 -0.201657
H  -2.643998 -1.895418 -0.813752
H  -1.036662 -2.488725 -1.283437
H  1.612216 -2.075008 -0.3231
H  1.644359 2.953597 0.40996
H  -0.498575 -2.956827 1.173794
H  -1.944081 -3.849673 0.614453
H  -2.129021 -2.383466 1.622055
H  3.790295 1.63161 0.351409
H  4.780031 -0.488775 0.102164
