program: Gaussian 09
title: 000298943
version: EM64L-G09RevD.01
frameworkgroup: C1[X(C11H4F3NO3)]
method: RPBEPBE
basis: SDD
operation: Freq
keyword: #p
keyword: freq=noraman
keyword: PBEPBE/SDD
title: #p freq=noraman PBEPBE/SDD
converged: YES YES NO NO
title: Mulliken charges:
elementType: F F F O O O N C C C C C C C C C C C H H H H
charge: -0.137373 -0.147808 -0.127419 -0.238553 -0.262146 -0.123978 0.003695 0.321555 0.098180 0.314212 -0.415294 -0.438610 -0.357685 -0.193634 0.326592 0.179149 0.332333 -0.192037 0.259358 0.290377 0.266579 0.242507
chargesum: 0.00000
title: Mulliken charges with hydrogens summed into heavy atoms:
elementType: F F F O O O N C C C C C C C C C C C
charge: -0.137373 -0.147808 -0.127419 -0.238553 -0.262146 -0.123978 0.003695 0.321555 0.098180 0.314212 -0.155936 -0.148233 -0.091106 0.048873 0.326592 0.179149 0.332333 -0.192037
polarizability: 1.50596560e+02 -1.34327140e+01 1.99137045e+02 -2.05921170e+00 1.26488817e+00 6.83421887e+01
1716.lowfreq: -5.3634 -2.5760 0.0004 0.0006 0.0008 0.8944 20.3268 34.7290 55.8708
frequency: 20.2784 34.7176 55.8666 65.6364 95.9521 128.5908 155.2769 188.9578 223.1497 242.4444 284.2040 291.1742 306.2195 372.2932 418.6911 445.5204 459.9906 472.4765 485.7975 538.3740 562.6332 574.8638 582.2115 601.3327 639.9428 653.8501 695.7589 719.0222 735.0915 775.5207 808.8679 840.1793 861.8395 894.4382 911.5058 978.9518 990.0397 1020.7603 1037.4492 1055.4811 1080.9335 1128.8348 1158.2826 1176.4607 1209.7366 1216.9801 1245.0454 1310.3982 1405.4630 1426.7310 1474.6717 1558.9073 1592.7344 1630.3050 1693.7487 2191.8131 3153.9593 3169.2862 3182.9602 3236.3409
redmass: 16.6421 13.4095 11.5183 9.5886 7.6396 11.0563 11.1916 10.0702 10.6656 5.4083 9.4505 13.8124 6.5657 15.5913 7.3307 15.3122 8.9771 10.0252 13.4971 5.0493 4.5952 9.3134 6.4481 6.6609 5.2171 11.4842 12.4673 6.8845 2.7544 3.0916 2.3542 6.7964 1.5151 8.8155 1.4438 1.3418 6.9235 12.2247 4.6410 2.5710 9.1486 2.1637 3.1584 1.2377 4.9970 6.0145 1.9623 3.3990 3.1485 6.5509 3.4521 7.3371 7.4616 9.1809 13.0700 12.5914 1.0874 1.0933 1.0991 1.0994
irintensity: 0.3275 0.2805 0.3976 0.8476 0.1708 2.0446 3.0873 2.8307 1.6592 5.2626 1.6692 0.8761 1.8495 2.3188 0.3463 4.4157 0.5806 14.0934 4.5345 2.9901 1.0396 5.9865 1.1873 8.1697 1.2161 11.3766 9.6889 3.0797 33.1954 14.5244 30.4526 14.8738 59.4061 18.5023 1.9732 2.1865 122.1352 225.0242 201.8041 42.9671 368.3715 13.6945 90.3944 15.3422 40.7795 20.1492 19.4987 15.2313 13.7853 24.3283 31.3757 2.6175 23.4023 2.3818 183.0003 29.1647 3.2953 6.4943 5.3777 2.1130
temp: 298.150 k
press: 1.00000 atm
elementType: 9 9 9 8 8 8 7 6 6 6 6 6 6 6 6 6 6 6 1 1 1 1
symmnumber: 1
zpe: 337759.3 jmol-1
zpe.correction: 0.128646 hartree
zpe.thermalcorrener: 0.143666 hartree
zpe.thermalcorrenthalpy: 0.144610 hartree
zpe.thermalcorrgfe: 0.084038 hartree
zpe.sumelectzpe: -1000.213600 hartree
zpe.sumelectthermal: -1000.198580 hartree
zpe.sumelectthermalent: -1000.197636 hartree
zpe.sumelectthermalfe: -1000.258208 hartree
dipole: -3.4626 -6.2364 -0.1636
dipole: 7.1350
quadrupole: -95.6226 -104.7131 -105.8194
quadrupole: 11.9224 -0.9337 -1.3225
quadrupole: 6.4291 -2.6614 -3.7678 11.9224 -0.9337 -1.3225
hfenergy: -1000.3422458 hartree
pointgroup: C01 [X(C11H4F3N1O3)]
dipole: 1.0325861 -2.6087083 0.0914032 debye
dipolederiv: -0.4357754 0.0494324 -0.0032427 0.0535021 -0.3644477 -0.2137505 -0.0035288 -0.2082716 -0.7040673 -0.69448 -0.2128007 0.0423188 -0.173108 -0.5360304 -0.0125046 0.0812727 0.006203 -0.2836912 -0.4808995 0.2053274 -0.1295003 0.2250526 -0.5435353 0.2283708 -0.095718 0.1871461 -0.4476604 -0.5480725 0.0472764 0.0487175 -0.1829537 -0.5296834 -0.040346 0.0352249 -0.0342329 -0.1012331 -1.1703583 0.5298754 -0.1500033 0.8725359 -0.7894405 0.326213 -0.2239381 0.2708986 -0.4817737 -0.3399723 -0.0380291 0.2297004 0.3039651 -0.4000645 0.1265353 -0.2656753 0.3394995 -0.6885775 -0.2265106 -0.0838987 -0.0040246 -0.0797923 -0.381033 -0.0074036 -0.0025716 -0.0010401 -0.2104394 -0.0964967 0.1380084 0.0201458 -0.052907 -0.0240699 -0.0055088 0.0214815 -0.0215379 0.0398466 -0.1315121 -0.0173148 0.0054837 0.2082081 0.2703058 0.0570148 0.0345503 0.015917 0.0490506 1.0193291 -0.2906685 0.0617347 -0.3096582 0.3533142 -0.0030572 -0.1296417 0.087448 0.0293979 0.0971212 -0.0664882 -0.0403705 0.0859764 0.1150219 0.0121246 -0.0353954 0.0170592 -0.1462196 0.0309535 0.0071325 -0.0283458 0.2281043 0.0606789 -0.0075054 -0.0160255 0.0077754 -0.1672141 -0.0511433 0.0389957 -0.060124 -0.0557087 -0.1970825 0.0096008 -0.0016067 -0.0141437 -0.1195011 -0.184282 -0.1253491 -0.0112568 -0.0205591 0.1441066 0.0098489 -0.0086749 0.0274882 -0.145923 0.7538769 0.0039645 -0.0685807 -0.2511757 -0.0484898 0.0145421 -0.0873893 -0.0137734 0.1639352 0.7751663 -0.2996609 -0.1188376 -0.8871768 0.8104299 -0.5210672 0.5038492 -0.660501 1.0514235 1.6084648 -0.0153913 0.1179522 -0.0959037 1.4760929 0.0372063 0.0984011 0.0047971 1.4162519 -0.0285892 0.1323114 0.0186202 0.1436413 0.4078738 0.0083075 0.0187241 0.0037855 0.0544176 -0.0197076 0.0765676 0.0245051 0.0418344 0.0600169 -0.0088836 0.0285526 -0.0117043 0.1670866 0.0298396 -0.0291717 0.0169478 0.0017459 0.1176701 -0.0041681 0.0208585 0.000204 0.190413 0.0129558 -0.0462589 0.0225233 -0.0616753 0.0939208 -0.0027834 0.0182916 0.0003804 0.171281 0.0800922 -0.0038598 0.0056369 0.0060525 -0.0955546 -0.0027854 0.0089587 -0.0033972 0.1631965 unknown
polarizability: 154.7200768|19.118237|194.734995|-4.7768245|-4.0387779|68.6207215 unknown
InChI: InChI=1S/C11H4F3NO3/c12-11(13,14)10(16)18-8-3-1-2-6-4-7(5-15)17-9(6)8/h1-4H
charge 0 multiplicity 1
22 atoms
F  -3.11912 1.448764 1.413792
F  -4.278528 -0.112511 0.234353
F  -3.80287 1.899928 -0.700376
O  1.109273 0.829968 0.137179
O  -1.508865 -0.628742 0.464331
O  -1.461278 0.660708 -1.511086
N  3.380179 3.508615 -0.018133
C  2.198916 -1.21746 -0.088765
C  0.946041 -0.55904 0.091018
C  -0.257554 -1.271501 0.211576
C  2.244618 -2.63495 -0.136351
C  3.18895 -0.162596 -0.16603
C  -0.207542 -2.674101 0.176546
C  1.036321 -3.345083 0.001829
C  2.515985 1.041744 -0.02761
C  -1.97372 0.32737 -0.439603
C  -3.29856 0.898559 0.132686
C  2.971528 2.384082 -0.020994
H  3.192864 -3.1631 -0.271961
H  4.26246 -0.272255 -0.303699
H  -1.139127 -3.237237 0.285342
H  1.041532 -4.438858 -0.025443
