program: Gaussian 09
title: 000298945
version: EM64L-G09RevD.01
frameworkgroup: C1[X(C12H15Cl2NO2)]
method: RPBEPBE
basis: SDD
operation: Freq
keyword: #p
keyword: freq=noraman
keyword: PBEPBE/SDD
title: #p freq=noraman PBEPBE/SDD
converged: YES YES NO NO
title: Mulliken charges:
elementType: Cl Cl O O N C C C C C C C C C C C C H H H H H H H H H H H H H H H
charge: 0.030668 -0.005048 -0.407919 -0.241491 -0.415945 -0.218422 0.514013 -0.545918 0.316312 -0.006344 0.299288 -0.683444 -0.680369 -0.543899 -0.847302 0.343778 -0.731972 0.154678 0.303478 0.226354 0.230089 0.213815 0.225637 0.213955 0.230836 0.255633 0.250624 0.234544 0.234622 0.349189 0.341794 0.358769
chargesum: 0.00000
title: Mulliken charges with hydrogens summed into heavy atoms:
elementType: Cl Cl O O N C C C C C C C C C C C C
charge: 0.030668 -0.005048 -0.066125 -0.241491 -0.066756 -0.063744 0.514013 -0.242440 0.316312 -0.006344 0.299288 -0.013187 -0.009942 -0.288266 -0.127512 0.343778 -0.373204
polarizability: 2.37141750e+02 1.45091106e+00 1.78652524e+02 1.31859824e+00 2.29139553e-01 1.13797728e+02
1716.lowfreq: -6.7413 -0.0018 -0.0015 0.0020 5.0307 7.2062 16.2581 19.3598 39.3325
frequency: 16.0533 19.2888 39.3128 63.7898 77.0628 85.6328 121.2039 136.4591 177.4262 201.9673 210.0579 220.2734 226.9387 242.9072 253.9877 257.4649 273.4631 337.9285 341.1350 373.6073 381.0346 416.5399 428.1493 447.3400 490.1289 498.7027 562.0100 577.7139 612.6574 647.9393 683.7061 690.0151 702.4108 731.1795 737.9915 747.6213 864.1558 875.2888 888.4397 915.8668 935.6707 941.7810 956.0790 996.1523 1039.6288 1043.5170 1098.8000 1115.5707 1126.3762 1159.4416 1179.1041 1182.8572 1198.2645 1212.6910 1234.5287 1275.8516 1278.6758 1321.9000 1336.0912 1380.9924 1394.8407 1399.4326 1400.3924 1431.0076 1465.7972 1467.6849 1469.1762 1479.9787 1482.4920 1485.9785 1497.4390 1533.8063 1589.1084 1613.3114 1639.6575 2913.9204 2960.7841 2979.4366 2982.3312 3031.0584 3075.6529 3080.7095 3082.1391 3087.0003 3093.9254 3157.4511 3164.6535 3177.9688 3493.4649 3556.7396
redmass: 3.5623 5.1354 13.1570 6.6537 5.9451 3.3452 7.4734 5.4561 1.2080 3.4214 2.7790 1.2340 2.9614 2.6066 1.9891 3.0483 3.4913 3.9438 4.2277 1.1531 13.9319 3.5311 3.7995 5.0743 3.3300 3.7463 3.1029 7.9181 5.5655 2.8045 4.5069 2.9048 2.2525 5.1402 9.2812 3.1801 3.6321 1.4540 2.7260 1.1629 1.4282 5.6190 1.4355 1.5271 2.3381 1.5287 1.9896 2.4383 1.5722 1.9948 1.8132 1.2765 1.8068 1.5819 1.9773 1.4005 1.3760 4.0849 1.8330 1.1899 2.5297 1.2771 1.2660 4.7083 1.0445 1.4334 1.0508 1.0574 1.0459 1.1216 1.8553 2.0164 4.7175 8.0656 6.3306 1.0812 1.0401 1.0349 1.0354 1.0980 1.1005 1.0999 1.1007 1.0999 1.0951 1.0920 1.0897 1.0915 1.0760 1.0651
irintensity: 0.0220 0.0743 0.5626 5.7192 0.2955 0.1683 3.5519 2.6422 0.6261 1.7226 2.2766 1.0560 0.8352 0.5757 3.1219 0.2188 1.9233 0.0043 1.3518 116.6092 5.3176 24.5061 1.9732 28.1051 9.6022 11.0886 2.5007 65.9525 19.4061 7.1664 11.9606 53.2655 106.0334 12.8184 26.9787 1.1071 47.0676 13.3955 16.6231 5.1834 21.9138 8.8427 0.8305 35.0452 12.3174 6.8915 3.3549 2.1636 131.3374 34.8670 22.0905 22.3817 24.9000 39.5297 23.0277 11.4104 2.5693 3.1046 29.2705 15.4616 1.4915 12.3787 13.5861 57.5782 2.0772 128.3520 4.0935 2.8679 15.5784 9.1115 45.9526 234.4071 4.0007 272.2594 22.4896 56.9733 27.1328 28.6291 29.8430 17.1863 2.9537 84.3491 20.4085 35.2313 15.5074 6.6249 0.9052 3.9729 40.1627 43.8083
temp: 298.150 k
press: 1.00000 atm
elementType: 17 17 8 8 7 6 6 6 6 6 6 6 6 6 6 6 6 1 1 1 1 1 1 1 1 1 1 1 1 1 1 1
symmnumber: 1
zpe: 650625.9 jmol-1
zpe.correction: 0.247810 hartree
zpe.thermalcorrener: 0.266443 hartree
zpe.thermalcorrenthalpy: 0.267388 hartree
zpe.thermalcorrgfe: 0.198514 hartree
zpe.sumelectzpe: -1590.332658 hartree
zpe.sumelectthermal: -1590.314025 hartree
zpe.sumelectthermalent: -1590.313080 hartree
zpe.sumelectthermalfe: -1590.381954 hartree
dipole: 1.7615 0.9638 -0.2814
dipole: 2.0276
quadrupole: -109.7457 -114.6071 -118.4527
quadrupole: -10.0602 1.0667 0.8486
quadrupole: 4.5228 -0.3386 -4.1842 -10.0602 1.0667 0.8486
hfenergy: -1590.580468 hartree
pointgroup: C01 [X(C12H15Cl2N1O2)]
dipole: 0.7536301 -0.2406982 0.1021994 debye
polarizability: 235.4899505|9.8202193|180.2469647|-1.3379054|1.8344218|113.8550868 unknown
InChI: InChI=1S/C12H15Cl2NO2/c1-6(2)8-5-9(7(3)4-10(8)16)15-12(17)11(13)14/h4-6,11,15-16H,1-3H3
charge 0 multiplicity 1
32 atoms
Cl -4.531693 -0.038525 -1.546036
Cl -4.345542 -1.621412 1.084821
O  4.050163 -0.968149 -0.37147
O  -2.087216 1.542332 0.450363
N  -1.57571 -0.73071 0.034292
C  2.796235 1.76311 0.08019
C  2.018709 0.447475 -0.042051
C  0.608142 0.457404 0.051446
C  -0.150954 -0.730768 -0.056009
C  2.656157 -0.805853 -0.254177
C  0.496903 -1.989328 -0.265297
C  2.554104 2.446313 1.452747
C  2.464096 2.726524 -1.091426
C  1.899654 -1.996257 -0.361854
C  -0.291124 -3.283571 -0.38229
C  -2.417777 0.331011 0.258874
C  -3.917442 0.006136 0.227548
H  3.889618 1.558444 0.021833
H  0.078827 1.398479 0.215199
H  2.819665 1.773955 2.287992
H  1.491948 2.726823 1.569862
H  3.15894 3.367816 1.538472
H  2.681989 2.260755 -2.069226
H  3.05291 3.65863 -1.008056
H  1.393303 2.998605 -1.079041
H  2.439258 -2.934491 -0.523399
H  0.388596 -4.13783 -0.530432
H  -0.884173 -3.496764 0.529504
H  -0.988331 -3.272127 -1.244015
H  -2.030738 -1.645183 -0.050985
H  4.51118 -0.096311 -0.28282
H  -4.487799 0.791469 0.735342
