program: Gaussian 09
title: 000298965
version: EM64L-G09RevD.01
frameworkgroup: C1[X(C13H15Cl2N5O2S)]
method: RPBEPBE
basis: SDD
operation: Freq
keyword: #p
keyword: freq=noraman
keyword: PBEPBE/SDD
title: #p freq=noraman PBEPBE/SDD
converged: YES YES NO NO
title: Mulliken charges:
elementType: Cl Cl S O O N N N N N C C C C C C C C C C C C C H H H H H H H H H H H H H H H
charge: 0.047653 0.044794 0.927093 -0.534454 -0.530982 -0.319138 -0.406210 -0.014810 -0.005315 0.122754 -0.340545 -0.338745 -0.057101 -0.653299 -0.653797 -0.242541 -0.227145 0.478250 -0.436475 -0.302702 0.122278 -0.267247 -0.234113 0.220239 0.258910 0.235393 0.229031 0.222939 0.256212 0.216113 0.264065 0.211387 0.212101 0.300514 0.278737 0.240820 0.324456 0.350880
chargesum: 0.00000
title: Mulliken charges with hydrogens summed into heavy atoms:
elementType: Cl Cl S O O N N N N N C C C C C C C C C C C C C
charge: 0.047653 0.044794 0.927093 -0.534454 -0.530982 -0.319138 -0.055330 -0.014810 -0.005315 0.122754 0.138604 0.125680 -0.057101 0.041965 0.033756 0.057973 0.051592 0.478250 -0.195655 0.021754 0.122278 -0.267247 -0.234113
polarizability: 4.06123918e+02 8.97444134e+00 2.37094118e+02 -7.60461509e+00 3.19714859e-01 1.36592686e+02
1716.lowfreq: -8.1878 -4.3385 0.0008 0.0011 0.0025 3.6079 11.7002 22.1005 36.5751
frequency: 10.4093 21.9653 36.4831 49.7755 53.0814 59.9265 73.9891 104.2466 115.9056 133.3887 144.7213 146.9336 157.9236 168.8345 189.1494 206.4117 212.2177 217.9370 229.4482 250.8686 261.4925 282.2424 311.0304 330.6851 353.7355 380.7348 395.2791 396.6025 412.8730 431.8288 434.8366 446.7267 476.8722 531.5006 576.8740 611.0181 620.3621 637.4790 647.3312 689.8822 724.7743 734.6890 738.7177 756.5034 779.7575 793.1652 794.6115 817.5387 839.1725 844.9313 858.4517 880.7195 900.3565 926.2723 960.0587 974.4815 992.4160 996.7978 1004.0035 1054.0140 1055.3968 1072.3307 1083.8788 1119.3490 1150.5867 1159.9453 1180.1719 1185.5279 1189.6832 1245.0856 1264.0073 1273.7843 1298.3895 1300.7996 1336.9905 1344.2491 1353.7025 1384.0371 1393.7543 1398.4119 1409.0380 1437.0116 1448.2356 1450.5517 1467.6635 1473.8988 1480.9934 1486.0231 1491.8237 1500.6028 1560.9911 1600.0387 1605.1148 2975.8259 2988.7243 2992.4842 2995.7845 3028.7087 3061.1399 3081.0735 3085.7930 3107.6183 3119.8384 3129.3169 3161.6965 3165.0205 3197.5525 3509.7300
redmass: 6.3064 6.7513 4.1437 7.5770 3.8231 3.7659 2.8436 2.6830 8.0721 7.1376 11.7435 4.4058 4.6929 11.4966 2.6146 13.7989 4.7715 5.6375 2.8019 1.9189 2.6751 2.0399 8.6302 4.2968 4.4639 4.8257 10.5863 3.4206 2.9646 9.4667 6.0584 8.9116 5.9843 2.8550 3.9113 7.2214 11.9762 7.8099 4.2740 8.4535 2.2791 1.9860 1.9009 1.2700 9.6372 7.4466 11.0928 1.5402 6.8706 1.3167 1.5325 13.3222 2.2320 14.1281 7.4103 1.3525 5.0227 1.3455 3.0275 1.9590 2.2732 1.7961 1.7894 1.4417 4.5387 1.8229 3.1237 1.2385 6.2155 3.1633 6.6323 1.2495 1.4589 1.1615 3.6917 1.2012 1.1759 1.2039 1.1937 9.6229 3.2792 1.0758 5.0609 1.0789 1.0454 1.0469 2.7965 1.0467 1.0496 3.0609 4.5403 5.9852 4.6830 1.0598 1.0371 1.0578 1.0428 1.1011 1.0993 1.0980 1.0978 1.1021 1.0996 1.0901 1.0949 1.0916 1.0955 1.0754
irintensity: 1.1768 0.6740 0.3330 1.5767 0.0040 1.5514 0.1677 0.3835 2.0825 1.5297 0.5510 0.7896 0.9030 0.5295 1.1585 1.1819 2.5525 2.7152 9.2443 6.6508 8.9395 3.0432 28.0098 5.5653 1.2251 4.1089 2.9435 23.1524 0.2528 3.8228 9.8890 21.2105 34.3029 37.4468 121.7171 27.3749 0.0287 118.4238 6.4051 22.6377 20.2583 29.8632 32.8553 10.2986 93.7955 10.1535 105.7652 0.6337 53.9604 21.1233 70.7947 4.6841 7.0336 68.9854 45.8468 0.9524 3.1290 2.7855 50.0002 16.5883 45.7959 5.1177 6.3854 31.0573 57.6013 1.6477 54.5365 13.8471 329.4316 98.4561 27.0757 16.5312 33.9665 27.7212 344.5864 5.2002 8.3114 14.6162 55.9217 95.5652 7.6836 13.5400 610.2836 17.9791 3.4298 15.0443 67.7357 9.0035 14.0302 773.8652 923.5942 41.7346 143.4343 20.2605 30.0047 26.4819 27.4445 11.0285 3.8911 50.3234 18.3885 16.1386 26.9871 10.0367 7.8244 4.3496 13.6931 52.7675
temp: 298.150 k
press: 1.00000 atm
elementType: 17 17 16 8 8 7 7 7 7 7 6 6 6 6 6 6 6 6 6 6 6 6 6 1 1 1 1 1 1 1 1 1 1 1 1 1 1 1
symmnumber: 1
zpe: 717680.5 jmol-1
zpe.correction: 0.273350 hartree
zpe.thermalcorrener: 0.297100 hartree
zpe.thermalcorrenthalpy: 0.298044 hartree
zpe.thermalcorrgfe: 0.216746 hartree
zpe.sumelectzpe: -2244.885023 hartree
zpe.sumelectthermal: -2244.861273 hartree
zpe.sumelectthermalent: -2244.860329 hartree
zpe.sumelectthermalfe: -2244.941626 hartree
dipole: 0.8334 -1.8811 4.1526
dipole: 4.6343
quadrupole: -182.3668 -152.6898 -161.7562
quadrupole: 11.1282 24.0115 0.9144
quadrupole: -16.7625 12.9144 3.8481 11.1282 24.0115 0.9144
hfenergy: -2245.1583728 hartree
pointgroup: C01 [X(C13H15Cl2N5O2S1)]
dipole: -0.3141875 -0.1740895 -1.7875562 debye
polarizability: 401.6799995|-29.5361977|232.9037617|-0.548981|28.7883174|145.2269608 unknown
InChI: InChI=1S/C13H15Cl2N5O2S/c1-3-20(4-2)23(21,22)10-7-5-9(6-8-10)16-13-18-11(14)17-12(15)19-13/h5-8,16H,3-4H2,1-2H3
charge 0 multiplicity 1
38 atoms
Cl 7.18673 -2.202188 -0.569833
Cl 5.075557 2.510105 0.909768
S  -3.514822 0.197753 0.710819
O  -4.388774 -1.181963 0.566569
O  -3.582649 1.084777 2.075669
N  -3.78883 1.422839 -0.673811
N  2.244225 -1.56913 -0.168222
N  3.586363 0.353819 0.340181
N  4.545692 -1.784881 -0.331779
N  5.989906 0.096162 0.15648
C  -4.720481 2.519035 -0.277179
C  -3.891322 0.77783 -2.011822
C  -1.723986 -0.296642 0.39227
C  -6.165579 2.149352 0.133464
C  -5.213511 0.083674 -2.417743
C  -1.469791 -1.613684 -0.022723
C  -0.705136 0.634143 0.649015
C  0.926138 -1.080082 0.037098
C  -0.12996 -2.003268 -0.202572
C  0.63692 0.24473 0.466993
C  3.466162 -0.962303 -0.041621
C  5.742273 -1.19344 -0.211515
C  4.857948 0.795169 0.411789
H  -4.722088 3.204592 -1.148133
H  -4.239105 3.05341 0.560443
H  -3.64723 1.583933 -2.732689
H  -3.059017 0.049801 -2.076672
H  -6.724757 1.648385 -0.672289
H  -6.15853 1.490691 1.019187
H  -6.708251 3.072757 0.409227
H  -5.506305 -0.668918 -1.666347
H  -6.037295 0.806226 -2.544506
H  -5.067833 -0.428923 -3.387298
H  -2.301371 -2.30921 -0.175718
H  -0.949349 1.643281 0.994199
H  0.096527 -3.027191 -0.523824
H  1.453589 0.942533 0.654397
H  2.328439 -2.54818 -0.460974
