program: Gaussian 09
title: 000298966
version: EM64L-G09RevD.01
frameworkgroup: C1[X(C13H13Cl4N5O2S)]
method: RPBEPBE
basis: SDD
operation: Freq
keyword: #p
keyword: freq=noraman
keyword: PBEPBE/SDD
title: #p freq=noraman PBEPBE/SDD
converged: NO YES NO NO
title: Mulliken charges:
elementType: Cl Cl Cl Cl S O O N N N N N C C C C C C C C C C C C C H H H H H H H H H H H H H
charge: -0.065453 -0.029270 0.050414 0.050791 0.969978 -0.509934 -0.525383 -0.349159 -0.408012 -0.004982 -0.015895 0.125110 -0.329872 -0.329379 -0.062905 -0.577691 -0.565521 -0.204880 -0.251685 0.478583 -0.431842 -0.304115 0.125243 -0.233869 -0.267163 0.259853 0.252293 0.291845 0.234624 0.315041 0.283402 0.275198 0.258963 0.279301 0.295104 0.242221 0.327573 0.351475
chargesum: 0.00000
title: Mulliken charges with hydrogens summed into heavy atoms:
elementType: Cl Cl Cl Cl S O O N N N N N C C C C C C C C C C C C C
charge: -0.065453 -0.029270 0.050414 0.050791 0.969978 -0.509934 -0.525383 -0.349159 -0.056538 -0.004982 -0.015895 0.125110 0.182273 0.197090 -0.062905 0.020751 -0.031360 0.074421 0.043419 0.478583 -0.189621 0.023458 0.125243 -0.233869 -0.267163
polarizability: 4.15837162e+02 -1.70825978e+01 2.47840619e+02 1.82287578e+01 2.92398458e+01 1.64444198e+02
1716.lowfreq: -7.0210 -5.5728 -0.0009 0.0012 0.0014 0.7154 11.7771 12.8852 17.6431
frequency: 9.7235 12.6988 17.3674 37.8806 39.9147 55.2255 56.5980 63.6267 69.0640 110.6934 114.7236 131.0086 143.0922 155.9490 156.1127 170.1497 188.9042 202.1120 210.2005 220.1456 228.5718 240.1444 262.1730 277.4887 308.7010 331.7918 342.0109 368.9850 390.7826 407.7033 416.1221 430.0755 444.7054 448.9025 483.0335 531.9759 578.6239 611.6820 621.1470 622.6516 635.7328 647.3999 683.4037 691.1698 723.9659 733.7616 760.9417 780.8517 794.0812 797.7560 811.4301 833.4628 840.4670 879.8944 881.5632 906.4737 935.5260 944.8960 959.1151 961.3186 990.9840 998.5083 1009.6874 1019.4614 1053.2592 1057.6983 1121.8998 1124.2667 1153.6330 1187.9337 1189.9710 1191.4832 1229.2884 1246.2260 1247.1438 1253.7214 1260.9560 1297.9456 1298.9085 1317.7979 1339.3958 1348.0650 1373.3059 1399.7511 1410.7971 1435.5450 1441.5719 1447.0405 1451.5384 1468.3388 1480.6849 1500.1401 1560.0416 1600.3920 1605.2765 2942.8917 2986.7560 3029.4715 3044.5273 3050.2171 3084.0072 3126.9069 3130.4751 3157.8699 3167.6769 3173.2099 3196.7843 3509.8069
redmass: 11.8117 16.3911 13.7089 10.6729 9.0043 5.0680 11.4817 5.5617 10.5187 4.4252 6.6447 10.1259 11.1367 5.2190 6.3386 11.2999 5.6153 11.2740 8.6384 3.9443 7.8125 8.3278 5.7232 3.9221 10.3991 5.1448 3.5633 3.8493 13.3458 8.3322 3.1523 12.4577 11.5621 3.7565 8.9486 2.8509 4.9772 7.3126 11.8202 4.2022 7.5266 4.0146 5.8653 8.4509 2.0055 2.3453 1.2842 9.5998 7.3142 14.1776 2.2089 1.4414 6.6043 1.3789 12.9898 2.1159 7.1103 2.3756 1.6605 4.0740 5.0335 1.5013 1.3314 3.7697 2.0887 2.3995 1.4276 1.4028 4.5014 1.2183 1.3547 6.7469 2.9609 1.1880 3.2449 1.1704 6.5343 1.2287 1.4065 1.1503 3.7171 1.1989 1.2398 9.2462 3.3367 1.0729 1.0894 5.1196 1.0864 1.0945 2.7918 3.2098 4.2661 5.6422 4.8265 1.0659 1.0596 1.0915 1.1034 1.0599 1.0570 1.1099 1.0904 1.0914 1.0955 1.1118 1.0950 1.0755
irintensity: 0.4590 0.0169 0.8939 0.7006 1.6948 1.4174 1.1020 2.0760 1.8903 0.5665 0.3892 2.2769 0.3285 1.1278 0.8321 0.8445 6.6161 2.4623 4.4423 3.5299 1.1135 5.3198 7.0659 20.0846 29.0897 4.3430 13.9051 3.4145 3.4996 16.7645 2.4004 10.1531 30.0301 15.7648 57.4841 42.1175 105.8217 22.3031 0.1906 13.2878 101.2703 7.0821 101.3377 25.8951 25.9699 12.9782 28.8095 113.9243 12.6579 74.7492 32.8217 56.8544 54.9031 44.7016 4.3436 28.5906 62.1285 22.3608 12.9370 35.9771 2.4493 3.1801 2.1376 8.4070 25.6260 37.6873 24.3172 16.7114 60.5728 11.8306 3.3274 352.9518 61.0899 5.6748 105.0018 11.2187 24.2803 16.9664 35.4628 26.8856 335.4661 2.4862 1.0477 106.1490 4.0571 32.3842 1.7201 625.4072 15.5569 16.9342 72.0371 811.1419 919.5552 95.6994 83.6556 35.7833 11.3926 8.3642 8.7433 23.8095 8.9628 14.3284 9.7111 4.2563 4.2625 5.7320 15.3209 52.6006
temp: 298.150 k
press: 1.00000 atm
elementType: 17 17 17 17 16 8 8 7 7 7 7 7 6 6 6 6 6 6 6 6 6 6 6 6 6 1 1 1 1 1 1 1 1 1 1 1 1 1
symmnumber: 1
zpe: 672474.4 jmol-1
zpe.correction: 0.256132 hartree
zpe.thermalcorrener: 0.281865 hartree
zpe.thermalcorrenthalpy: 0.282809 hartree
zpe.thermalcorrgfe: 0.194332 hartree
zpe.sumelectzpe: -3163.661735 hartree
zpe.sumelectthermal: -3163.636002 hartree
zpe.sumelectthermalent: -3163.635058 hartree
zpe.sumelectthermalfe: -3163.723534 hartree
dipole: -0.4247 -3.9761 -5.5278
dipole: 6.8225
quadrupole: -209.2050 -187.6062 -184.8297
quadrupole: 2.9765 -24.4813 10.8434
quadrupole: -15.3247 6.2741 9.0506 2.9765 -24.4813 10.8434
hfenergy: -3163.9178668 hartree
pointgroup: C01 [X(C13H13Cl4N5O2S1)]
dipole: 0.3667747 1.1430008 -2.4007852 debye
polarizability: 416.5544866|-17.2269973|234.7911264|4.4712247|-43.6900169|176.7763654 unknown
InChI: InChI=1S/C13H13Cl4N5O2S/c14-5-7-22(8-6-15)25(23,24)10-3-1-9(2-4-10)18-13-20-11(16)19-12(17)21-13/h1-4,18H,5-8H2
charge 0 multiplicity 1
38 atoms
Cl -3.641859 -4.033185 -0.710161
Cl -6.811367 0.138265 0.188324
Cl 4.797955 -2.872625 2.306504
Cl 7.908283 0.582514 -0.383465
S  -3.077315 0.883086 0.641036
O  -3.333031 -0.108525 1.909907
O  -3.629746 2.41485 0.602576
N  -3.652479 0.132898 -0.954124
N  2.943291 1.133731 -0.207811
N  5.237797 0.811638 -0.241963
N  3.82528 -0.754852 0.980514
N  6.228743 -1.06548 0.922213
C  -3.358987 -1.300957 -1.12707
C  -4.752054 0.828728 -1.632821
C  -1.214085 0.922128 0.375478
C  -4.187207 -2.275257 -0.257992
C  -6.155563 0.207722 -1.574738
C  -0.674411 1.958831 -0.405039
C  -0.424518 -0.053434 1.002749
C  1.549447 1.009639 0.028312
C  0.719653 1.997951 -0.576069
C  0.974132 -0.016546 0.825365
C  4.002228 0.36331 0.200677
C  4.968683 -1.400296 1.289789
C  6.275123 0.05973 0.153711
H  -2.284644 -1.476083 -0.925143
H  -3.516114 -1.53113 -2.199121
H  -4.783722 1.856665 -1.222578
H  -4.481643 0.911263 -2.708977
H  -3.98403 -2.150723 0.814006
H  -5.266689 -2.239359 -0.451018
H  -6.865702 0.835514 -2.136081
H  -6.190219 -0.825231 -1.953917
H  -1.3225 2.722534 -0.845372
H  -0.889947 -0.813142 1.639136
H  1.166867 2.799206 -1.176513
H  1.617254 -0.761724 1.294749
H  3.243795 1.928046 -0.782376
