program: Gaussian 09
title: 000298933
version: EM64L-G09RevD.01
frameworkgroup: C1[X(C10H5ClN4O5S)]
method: RPBEPBE
basis: SDD
operation: Freq
keyword: #p
keyword: freq=noraman
keyword: PBEPBE/SDD
title: #p freq=noraman PBEPBE/SDD
converged: YES YES NO NO
title: Mulliken charges:
elementType: Cl S O O O O O N N N N C C C C C C C C C C H H H H H
charge: -0.027705 0.340354 -0.172600 -0.183223 -0.187682 -0.202042 -0.208166 -0.346414 0.042479 0.029433 0.090874 0.344575 -0.245857 -0.282601 0.182950 0.415633 -0.354252 -0.378269 -0.119525 -0.070416 -0.214198 0.298985 0.317989 0.300810 0.322156 0.306714
chargesum: 0.00000
title: Mulliken charges with hydrogens summed into heavy atoms:
elementType: Cl S O O O O O N N N N C C C C C C C C C C
charge: -0.027705 0.340354 -0.172600 -0.183223 -0.187682 -0.202042 -0.208166 -0.024258 0.042479 0.029433 0.090874 0.344575 -0.245857 0.016384 0.182950 0.415633 -0.036264 -0.077459 -0.119525 -0.070416 0.092516
polarizability: 3.95651234e+02 -1.70106148e+01 2.00655940e+02 -1.63122397e+00 -1.02197976e+00 6.65076118e+01
1716.lowfreq: -4.4759 -1.1194 -0.0010 -0.0008 0.0015 4.1632 9.3806 14.5006 38.7609
frequency: 9.1138 14.4442 38.7519 45.8974 53.5757 76.3156 85.1703 133.9504 142.6450 158.7227 160.3757 178.9351 223.9401 262.7992 299.6931 307.1976 315.9347 337.7287 370.0955 436.9723 446.1134 469.8991 488.3921 490.6159 511.6087 555.4191 574.5439 604.9095 624.3383 650.3351 659.4482 673.2210 682.7643 702.4615 706.6079 723.6466 750.9263 761.2978 822.7080 879.4842 887.1905 888.1970 924.8329 995.5117 1012.4854 1037.0504 1061.5640 1100.3433 1105.0998 1134.6765 1194.2113 1211.5427 1224.2235 1241.7170 1254.1561 1289.3788 1348.6021 1356.9267 1384.7378 1397.1850 1450.2852 1466.8126 1504.2033 1538.7599 1575.1037 1596.2480 1627.4411 3165.3337 3188.0680 3193.4475 3218.3224 3418.9130
redmass: 14.6994 11.6746 10.5322 13.1294 16.3259 9.0005 14.1318 10.9982 8.6311 13.5509 5.8188 13.1546 15.5590 8.6262 11.1224 8.5785 11.1657 16.1032 13.3115 5.0287 5.6907 10.2053 5.1041 6.9777 5.9431 6.4775 12.8890 7.3972 8.0816 4.0429 7.0696 6.0248 1.7725 4.4553 5.9123 11.9618 9.5678 4.7117 9.6820 1.4718 1.5643 4.8140 1.4635 6.4599 1.3714 4.0220 6.6282 2.3707 3.3002 1.5021 4.8070 9.9312 4.8932 1.6446 1.3951 7.1092 13.9675 4.5535 9.7891 7.2957 2.5021 6.9817 3.3101 2.6307 8.2293 6.8799 4.9065 1.0903 1.0930 1.0959 1.0965 1.0784
irintensity: 0.0268 0.0266 7.0680 0.8988 0.1699 4.5813 0.0136 3.2836 2.7355 1.4076 0.1643 4.1166 2.5995 0.7605 0.5077 3.9158 0.9979 3.1497 8.0714 6.3660 7.7477 13.0743 14.9493 3.7965 0.2395 5.0440 10.0889 2.3520 0.3926 3.8931 5.9081 37.8896 36.8622 56.1823 39.2862 1.8930 32.8876 10.6849 38.0646 19.1187 17.4187 7.0451 30.6832 47.2044 1.5211 1.8610 8.1206 1.7366 258.1919 6.0732 960.0122 17.9759 98.2835 43.9291 55.6386 123.3852 130.3067 7.2876 13.8971 175.5071 18.2405 306.4833 974.1154 30.9510 5.9256 15.8710 137.3008 6.0998 12.9371 3.1482 5.7528 278.5415
temp: 298.150 k
press: 1.00000 atm
elementType: 17 16 8 8 8 8 8 7 7 7 7 6 6 6 6 6 6 6 6 6 6 1 1 1 1 1
symmnumber: 1
zpe: 397301.2 jmol-1
zpe.correction: 0.151324 hartree
zpe.thermalcorrener: 0.169982 hartree
zpe.thermalcorrenthalpy: 0.170927 hartree
zpe.thermalcorrgfe: 0.099462 hartree
zpe.sumelectzpe: -1835.636275 hartree
zpe.sumelectthermal: -1835.617617 hartree
zpe.sumelectthermalent: -1835.616673 hartree
zpe.sumelectthermalfe: -1835.688137 hartree
dipole: 3.0879 0.3585 -0.2566
dipole: 3.1193
quadrupole: -200.4141 -137.9854 -132.1169
quadrupole: 0.3762 0.4155 2.0455
quadrupole: -43.5753 18.8534 24.7219 0.3762 0.4155 2.0455
hfenergy: -1835.7875992 hartree
pointgroup: C01 [X(C10H5Cl1N4O5S1)]
dipole: -1.214415 -0.1543082 0.0861935 debye
dipolederiv: -0.4164369 -0.0642636 -0.2384802 -0.0315151 -0.051696 -0.0972833 -0.1785527 -0.096402 -0.4778647 -0.065723 -0.0082493 -0.0139477 -0.0074113 0.1743285 -0.0018155 -0.2884787 -0.0080147 -0.354003 -0.6659775 -0.0415809 0.115912 0.0384585 -0.3043123 0.0734739 -0.5584663 0.0857921 -0.8301297 -0.8373537 -0.0907007 -0.2012229 -0.100836 -0.2273884 -0.0683377 -0.1458527 -0.0576958 -0.5893401 -0.7496067 -0.0409364 0.1529512 -0.0502768 -0.2211319 -0.0286114 0.2097581 -0.0299283 -0.6563342 -1.1232134 -0.0218486 0.0942738 -0.0245793 -0.2249666 0.0009329 0.3243189 0.0079485 -0.4671414 -0.6481321 -0.0114895 -0.1292096 -0.0110442 -0.2312352 -0.0032384 -0.3628577 -0.0077447 -0.7601125 -2.7652644 -0.0209592 -0.4195397 0.0307244 -0.2863874 0.0295543 -0.461748 0.0082499 -0.5842109 -1.1370008 -0.0292123 0.0413182 -0.0330326 -0.1677429 -0.0078262 0.6538599 0.0111798 -0.4844318 1.9929492 0.1974494 -0.0038866 0.2244579 0.2250199 0.0937751 -0.1627676 0.0780499 1.0465898 2.354644 0.0501791 0.287752 0.0669886 0.2398833 0.0110145 0.4950444 0.0095556 1.1239244 -0.3780383 -0.0519241 -0.0178272 -0.1036133 0.0105823 -0.0052001 0.1107994 -0.0041152 -0.1744751 0.2873064 0.1349274 0.5715759 0.1320924 -0.0193355 0.1608529 0.2959249 0.1586808 0.7030714 -0.1874105 -0.0187502 -0.1300562 -0.0472367 -0.0795221 -0.0144049 0.0166246 0.011832 0.013255 2.2847295 0.0733175 0.0632177 -0.0092355 0.2885571 -0.1299627 1.2792565 -0.1492584 1.2265928 -0.6704975 -0.0704812 0.0274196 -0.0755292 0.0715984 0.0176204 0.1725031 0.0338885 0.1766107 -0.1290666 -0.0442768 -0.2413475 0.0041662 -0.053924 -0.0471053 0.0508589 -0.0215877 -0.2086081 0.0664089 0.0388788 0.1897634 0.0166567 -0.1002987 0.0262875 -0.1372359 -0.0122753 -0.0753271 2.112936 0.0461343 0.2974536 0.0732792 0.0476953 0.0262643 -0.4846412 0.0087534 0.6562652 -0.9816183 -0.0215905 -0.4414957 -0.0278378 -0.0861626 -0.0102091 -0.8209517 -0.0255046 -0.1011204 0.6903356 0.0242221 0.1169724 0.0032387 0.0097321 -0.0021625 0.295396 0.0088956 0.228776 0.1811984 0.0025716 0.0338942 0.0301714 0.1539807 0.000266 0.0208981 -0.0135411 0.0701437 0.1506404 -0.002731 0.0242609 -0.0066373 0.1766486 -0.0082631 -0.0141671 -0.0096229 0.0997371 0.0989548 -0.0151075 -0.0462019 -0.0171743 0.1726432 -0.0162074 -0.0123796 -0.0104013 0.1002626 0.4483837 -0.0116784 -0.1309659 -0.0762889 0.2948018 0.0009061 -0.3364133 0.0228867 0.2029643 0.086853 -0.0019001 -0.002584 0.0020145 0.1886322 -0.0003202 0.0392698 0.0003793 0.1149059 unknown
polarizability: 392.4448228|18.695326|67.8733453|26.0972868|7.9474272|202.4966178 unknown
InChI: InChI=1S/C10H5ClN4O5S/c11-7-3-5(14(17)18)1-2-6(7)9(16)13-10-12-4-8(21-10)15(19)20/h1-4,13H
charge 0 multiplicity 1
26 atoms
Cl -1.151202 0.381466 2.3901
S  3.353559 0.118173 1.51414
O  0.237821 0.320768 -2.075103
O  -6.501745 -0.700061 -0.895335
O  -6.214324 -0.415498 1.35225
O  7.050746 0.196287 -0.032502
O  6.281935 0.180838 2.135359
N  0.924347 0.03318 0.149632
N  2.969702 0.089526 -1.171226
N  -5.770893 -0.49051 0.144316
N  6.104085 0.175908 0.850239
C  -1.509937 -0.010265 -0.44076
C  -2.105977 0.058641 0.848725
C  -2.394112 -0.23675 -1.536962
C  -0.051995 0.142584 -0.866781
C  -4.304925 -0.324119 -0.068003
C  -3.487968 -0.091719 1.053833
C  -3.777977 -0.39722 -1.373016
C  2.300501 0.077731 -0.022851
C  4.748818 0.146175 0.367467
C  4.338035 0.130215 -0.961653
H  -1.937939 -0.269386 -2.53105
H  -3.93393 -0.031458 2.049457
H  -4.443174 -0.573966 -2.221266
H  0.5826 -0.048697 1.115724
H  5.02095 0.143154 -1.811231
