program: Gaussian 09
title: 000298986
version: EM64L-G09RevD.01
frameworkgroup: C1[X(C22H30N2O2)]
method: RPBEPBE
basis: SDD
operation: Freq
keyword: #p
keyword: freq=noraman
keyword: PBEPBE/SDD
title: #p freq=noraman PBEPBE/SDD
converged: YES YES NO NO
title: Mulliken charges:
elementType: O O N N C C C C C C C C C C C C C C C C C C C C C C H H H H H H H H H H H H H H H H H H H H H H H H H H H H H H
charge: -0.306181 -0.300461 -0.096833 -0.355501 -0.362448 -0.349175 -0.352561 -0.473073 -0.152588 -0.398540 -0.404758 -0.397483 0.357457 -0.456658 0.128699 -0.421929 0.406103 -0.370709 -0.271851 -0.468131 -0.435163 -0.275704 0.280642 -0.251153 -0.253904 -0.664089 0.228566 0.189004 0.212913 0.169778 0.177254 0.221088 0.213652 0.207329 0.249389 0.205844 0.193985 0.193732 0.200200 0.214296 0.189376 0.206826 0.253079 0.229150 0.336363 0.264153 0.226166 0.239776 0.236948 0.225019 0.227828 0.233393 0.216560 0.249091 0.224818 0.210416
chargesum: 0.00000
title: Mulliken charges with hydrogens summed into heavy atoms:
elementType: O O N N C C C C C C C C C C C C C C C C C C C C C C
charge: -0.306181 -0.300461 -0.096833 -0.019137 0.055121 0.033516 0.045781 -0.052091 0.096801 0.001290 -0.010826 0.006190 0.357457 0.003246 0.128699 -0.192779 0.406103 -0.106557 -0.045685 -0.228355 -0.198215 -0.050685 0.280642 -0.023325 0.196049 0.020236
polarizability: 2.24935017e+02 -1.39075844e+01 2.75438994e+02 2.43186709e+01 2.86222547e+00 2.66322002e+02
1716.lowfreq: -4.5377 0.0005 0.0006 0.0008 3.2080 7.7661 14.0611 19.8174 25.5506
frequency: 13.0775 19.1805 25.4474 34.4488 40.0993 46.0753 52.3126 70.8049 86.3281 91.6080 129.8501 144.7207 149.7861 159.6062 178.9176 213.6022 231.1295 245.4574 255.2707 265.3907 276.7487 313.6808 322.1007 344.6837 376.4709 390.2017 412.1606 413.9287 428.5593 448.6987 454.9108 473.7511 489.5805 505.3807 521.2422 538.9372 552.0220 585.0412 587.8716 606.7867 636.6038 663.9458 684.5233 698.5884 728.8456 747.9527 785.1085 789.9914 794.8227 802.1051 813.2504 816.3520 822.8105 845.4746 853.2198 869.2323 881.2998 897.8883 905.0728 917.3188 939.1717 956.4046 965.0279 978.1254 984.0010 993.3587 999.3693 1008.4294 1016.4944 1033.9285 1036.3266 1050.3121 1063.6357 1078.9223 1089.7989 1095.6549 1100.7611 1120.7215 1121.9703 1124.8573 1149.0896 1150.2068 1153.0913 1154.8506 1171.6289 1178.0242 1186.2609 1196.4376 1217.3512 1230.2488 1239.6450 1250.4208 1255.4700 1265.7856 1269.8647 1275.2716 1282.1806 1285.4156 1293.1905 1327.9857 1336.0417 1338.3570 1344.7494 1347.5030 1350.9329 1354.8655 1361.4217 1369.3214 1388.3847 1389.3306 1391.4135 1404.6835 1420.4944 1442.8180 1449.6967 1454.6918 1455.0517 1458.8069 1460.5107 1461.6772 1462.1962 1466.2420 1471.5831 1474.6801 1481.0266 1483.2040 1491.5805 1518.9746 1585.9566 1597.0079 1630.8348 1663.8471 2820.0013 2830.2508 2852.4480 2966.6618 2972.7731 2977.3516 2978.9482 2986.0089 2989.4329 3014.2221 3024.8076 3024.8749 3031.0022 3034.0051 3041.8620 3042.1770 3052.8097 3054.8291 3071.8307 3084.6770 3087.9580 3114.5297 3115.3355 3118.7296 3126.2419 3129.1080 3146.2361 3152.8646 3159.4048 3559.0883
redmass: 4.6336 4.5384 4.3054 4.6532 3.1714 3.6738 3.8187 4.4331 3.6179 4.3752 4.1195 3.2287 4.7141 3.2938 3.8312 1.5479 1.8847 2.6743 2.4606 2.7375 2.2902 3.1343 2.2690 2.7314 2.7103 2.1171 3.2681 3.2516 3.9294 2.8937 2.9766 3.2465 4.8345 2.8307 5.9337 1.7883 3.2221 2.8222 3.3639 1.2852 3.9638 3.1955 3.9499 11.4468 2.7783 1.3293 5.3799 1.8340 1.4402 1.4731 2.4893 1.7167 2.1518 2.9207 1.5505 2.0836 1.6906 2.8027 2.3930 1.4861 2.3813 1.2974 1.3716 2.8639 1.4932 1.3597 2.4226 2.7700 2.3663 2.4062 2.5822 2.2778 1.8354 2.3075 2.9634 2.1391 1.7946 2.5330 2.4591 4.8144 1.5395 1.4947 1.5589 1.6729 1.3448 1.1431 1.2577 1.7965 1.3495 1.7115 2.0771 1.4386 1.4556 1.2113 1.4455 1.5225 1.1093 1.1997 1.3716 1.3057 1.4599 1.4312 1.4654 1.6754 1.4470 1.3055 1.3159 1.3717 1.2434 1.5766 1.5399 3.3096 2.8504 2.3817 1.0972 1.6633 1.2662 1.0886 1.0813 1.0462 1.1440 1.0979 1.0907 1.0995 1.1005 1.0979 1.7291 3.4175 7.2268 5.2021 6.1985 8.6747 1.0715 1.0705 1.0703 1.0628 1.0641 1.0631 1.0614 1.0613 1.0360 1.0917 1.0596 1.0890 1.0944 1.0940 1.1029 1.0876 1.1032 1.0851 1.0944 1.0974 1.1035 1.1054 1.0861 1.0857 1.0902 1.0889 1.0941 1.0992 1.1003 1.0769
irintensity: 0.1324 0.2032 0.3291 0.0945 0.4213 2.9766 0.3968 6.0234 0.6989 0.2073 0.9144 0.3521 0.3053 0.8279 1.3232 7.1735 0.4629 1.6147 1.5765 0.5925 3.2738 16.3814 3.9527 3.9450 1.6122 12.4228 7.3697 2.4776 3.2556 1.5987 11.1176 2.0282 0.6295 1.5183 0.0356 1.8937 10.7617 7.3325 2.0716 104.0838 18.3916 3.0128 3.9242 25.1956 17.7024 2.5277 0.0527 59.9516 26.5173 0.8480 25.1940 46.7537 1.2458 2.6112 5.0254 2.0266 7.3474 19.4506 3.2570 0.9176 9.8432 2.6019 5.2120 4.2921 3.5221 0.4524 6.5310 14.3901 17.6165 16.3884 92.6322 7.7462 28.4804 31.9765 2.7053 36.3776 4.5988 7.5705 14.5302 117.3403 9.0402 3.9231 5.6016 31.8443 8.9125 7.0985 6.2734 116.9719 9.7624 71.7061 39.6840 30.7696 20.3268 4.9569 17.8087 3.4050 4.1581 6.2840 6.0979 5.2030 0.4865 2.6510 12.3293 20.1493 1.4074 3.4644 4.2150 5.6047 25.3277 7.7334 2.4547 1.0527 3.7149 5.6751 4.0357 2.8523 6.1632 14.2784 3.2027 13.1510 0.2850 11.8930 2.1020 51.7539 6.2197 16.1018 343.4020 6.9338 5.1558 4.9339 0.5865 297.5713 53.1603 89.5961 208.4619 43.8789 9.7445 74.9628 25.7875 29.2619 18.7216 4.3899 41.8494 25.9605 88.8094 47.3566 29.2912 34.0161 97.2683 18.3428 14.2062 44.5707 1.8418 34.0226 8.5532 0.2596 12.4376 22.3002 13.5037 39.5696 28.2760 35.1599
temp: 298.150 k
press: 1.00000 atm
elementType: 8 8 7 7 6 6 6 6 6 6 6 6 6 6 6 6 6 6 6 6 6 6 6 6 6 6 1 1 1 1 1 1 1 1 1 1 1 1 1 1 1 1 1 1 1 1 1 1 1 1 1 1 1 1 1 1
symmnumber: 1
zpe: 1259717.5 jmol-1
zpe.correction: 0.479801 hartree
zpe.thermalcorrener: 0.504987 hartree
zpe.thermalcorrenthalpy: 0.505931 hartree
zpe.thermalcorrgfe: 0.421313 hartree
zpe.sumelectzpe: -1114.351192 hartree
zpe.sumelectthermal: -1114.326006 hartree
zpe.sumelectthermalent: -1114.325062 hartree
zpe.sumelectthermalfe: -1114.409680 hartree
dipole: 1.6660 1.7134 0.0621
dipole: 2.3906
quadrupole: -150.9026 -154.9475 -145.3651
quadrupole: -7.1602 -1.8422 -3.4642
quadrupole: -0.4975 -4.5424 5.0399 -7.1602 -1.8422 -3.4642
hfenergy: -1114.8309929 hartree
pointgroup: C01 [X(C22H30N2O2)]
dipole: 0.5652768 -0.7465811 -0.0878671 debye
polarizability: 222.5015633|19.308555|271.84164|-17.8178183|2.6801344|272.3528105 unknown
InChI: InChI=1S/C22H30N2O2/c1-2-26-22(25)23-17-19(13-16-24-14-6-3-7-15-24)21-12-8-10-18-9-4-5-11-20(18)21/h4-5,8-12,19,23H,2-3,6-7,13-17H2,1H3
charge 0 multiplicity 1
56 atoms
O  -4.20983 1.657662 0.22359
O  -2.593257 3.241013 0.911635
N  2.815764 0.787722 0.19682
N  -2.403895 0.946911 1.402445
C  2.600082 0.000149 1.439654
C  3.232457 2.189324 0.467331
C  3.776406 0.111034 -0.716853
C  1.336408 0.419303 2.222342
C  0.021274 0.254289 1.407026
C  3.332976 3.004995 -0.837769
C  3.898372 0.861868 -2.058358
C  4.308807 2.334248 -1.830223
C  -0.333244 -1.222707 1.176113
C  -1.126615 1.026151 2.11772
C  -0.192267 -1.862456 -0.117754
C  -0.816064 -1.985809 2.252512
C  -0.592759 -3.253269 -0.268097
C  0.342155 -1.18945 -1.271801
C  -1.191132 -3.355145 2.107117
C  -1.091673 -3.977169 0.863044
C  -0.475821 -3.889139 -1.549413
C  0.447112 -1.838685 -2.504258
C  -3.011681 2.052656 0.857281
C  0.027739 -3.198184 -2.651539
C  -4.954556 2.745131 -0.466466
C  -4.418695 2.965955 -1.884688
H  2.499791 -1.062286 1.146873
H  3.487065 0.066076 2.121704
H  2.49468 2.659744 1.141257
H  4.224784 2.211112 0.993561
H  4.792887 0.035719 -0.246171
H  3.415619 -0.919703 -0.8920
H  1.287134 -0.190637 3.146642
H  1.425772 1.474451 2.54971
H  0.18368 0.753728 0.437216
H  2.326145 3.071479 -1.293824
H  3.661008 4.035355 -0.600912
H  4.635487 0.344322 -2.702177
H  2.91967 0.827795 -2.576857
H  4.329791 2.885675 -2.789208
H  5.33734 2.367869 -1.414288
H  -1.256145 0.657342 3.155375
H  -0.863311 2.096407 2.178501
H  -0.914984 -1.521505 3.241377
H  -2.840542 0.035858 1.252341
H  0.707602 -0.162189 -1.174764
H  -1.564182 -3.908453 2.97597
H  -1.388913 -5.024792 0.734747
H  -0.789107 -4.935876 -1.645607
H  0.860156 -1.303415 -3.366839
H  0.111175 -3.692803 -3.625599
H  -4.874427 3.6670 0.136426
H  -5.996247 2.384562 -0.470876
H  -3.382474 3.342633 -1.851565
H  -4.440829 2.026381 -2.46371
H  -5.042188 3.713153 -2.41092
