program: Gaussian 09
title: 000298931
version: EM64L-G09RevD.01
frameworkgroup: C1[X(C15H10N2O5)]
method: RPBEPBE
basis: SDD
operation: Freq
keyword: #p
keyword: freq=noraman
keyword: PBEPBE/SDD
title: #p freq=noraman PBEPBE/SDD
converged: YES YES NO NO
title: Mulliken charges:
elementType: O O O O O N N C C C C C C C C C C C C C C C H H H H H H H H H H
charge: -0.223719 -0.201281 -0.188513 -0.197268 -0.194437 0.025139 0.024809 0.328058 0.514018 -0.464586 -0.503203 0.104060 -0.253495 0.364871 -0.346553 0.360857 -0.381620 -0.302103 -0.354951 -0.208867 -0.360640 -0.198785 0.331335 0.297580 0.279225 0.230051 0.236009 0.208935 0.293336 0.243532 0.293720 0.244486
chargesum: 0.00000
title: Mulliken charges with hydrogens summed into heavy atoms:
elementType: O O O O O N N C C C C C C C C C C C C C C C
charge: -0.223719 -0.201281 -0.188513 -0.197268 -0.194437 0.025139 0.024809 0.328058 0.514018 -0.133252 -0.205623 0.104060 0.025730 0.364871 -0.116502 0.360857 -0.145612 -0.093168 -0.061615 0.034665 -0.066920 0.045701
polarizability: 4.15778421e+02 1.72967041e+00 2.11065818e+02 5.24733215e-01 7.27853848e-01 7.45051942e+01
1716.lowfreq: -3.1058 0.0004 0.0005 0.0008 1.6822 5.0739 10.1215 16.8089 39.8485
frequency: 10.0316 16.7939 39.8448 50.3281 52.9922 92.3246 97.8470 120.9557 140.9851 159.8950 168.8696 191.0053 219.1834 264.1389 277.9291 306.7091 365.1757 385.4278 415.6740 422.0105 425.7241 460.8213 489.8064 516.3764 518.2273 548.1191 571.4853 642.1258 650.9605 657.1806 679.6353 686.2147 693.1076 700.8979 741.6175 751.1603 794.3223 817.5049 822.6292 872.6119 882.4051 909.3594 937.5834 943.0141 949.1565 981.8737 987.4604 988.6259 1002.3938 1003.9799 1017.1836 1052.2114 1078.4826 1088.5842 1090.2768 1093.0313 1177.2687 1182.8670 1200.7924 1210.6980 1226.8444 1228.3487 1278.1891 1300.6735 1306.8002 1328.1036 1377.2145 1379.0408 1392.3161 1396.4047 1431.0051 1437.6280 1473.8092 1480.7359 1527.1886 1577.8539 1587.3548 1611.6197 1613.9352 1640.2451 3102.6939 3143.1751 3146.6082 3152.7846 3165.0487 3167.3401 3168.8213 3176.6472 3187.7878 3188.8530
redmass: 6.2299 10.4109 8.5130 12.4655 13.8959 5.7758 3.7894 7.3059 9.7626 5.3773 4.7373 3.6958 8.9879 5.9454 3.3313 8.3135 8.8829 8.6191 6.1007 3.3845 3.2148 5.4303 7.7860 5.2286 5.6834 5.0929 6.7797 7.0610 4.7636 8.2126 2.3203 9.0676 2.2696 4.7985 4.4883 10.7886 9.3337 1.5029 1.6055 5.8868 1.9616 3.8864 1.4434 1.4471 1.4363 1.4762 6.0978 6.0913 1.3677 1.3685 1.2462 2.6952 1.7129 1.9260 2.0873 1.5930 1.1733 1.1579 4.4440 2.9580 3.4866 2.8116 1.3843 1.5067 2.0958 1.4462 10.3225 11.3622 6.1709 6.0430 3.2015 3.3568 2.6392 2.7046 10.1993 6.1605 6.8331 7.0698 6.8800 5.6980 1.0899 1.0895 1.0878 1.0882 1.0936 1.0933 1.0931 1.0921 1.0970 1.0966
irintensity: 0.1606 0.0951 1.0562 0.0172 1.2976 0.5504 0.4635 0.2196 0.7956 2.6779 0.2959 0.1154 4.1106 1.6183 1.2989 6.9832 3.4914 1.4636 2.1678 0.4885 0.8110 2.1534 2.5320 7.0656 5.7733 2.2963 42.0205 1.9282 3.5960 40.3251 30.0916 27.1595 11.0977 49.0793 1.1722 20.9419 15.4118 70.4170 1.2764 5.7002 21.5410 1.8995 0.2007 0.5011 7.6289 13.6854 4.9969 0.9783 0.2831 0.4649 51.0351 50.7213 119.1729 36.5291 0.1526 44.8731 79.7046 6.4103 591.6308 51.8035 47.7594 70.2712 0.0135 4.6874 205.3109 9.9910 65.5737 128.1661 11.0124 73.7676 2.5560 55.5716 3.5800 48.7078 160.5296 4.0777 68.8123 45.2338 0.6514 238.3318 0.0461 5.0475 9.8997 5.1786 4.7042 7.2297 14.4681 13.5981 6.2102 5.7417
temp: 298.150 k
press: 1.00000 atm
elementType: 8 8 8 8 8 7 7 6 6 6 6 6 6 6 6 6 6 6 6 6 6 6 1 1 1 1 1 1 1 1 1 1
symmnumber: 1
zpe: 585039.5 jmol-1
zpe.correction: 0.222830 hartree
zpe.thermalcorrener: 0.241508 hartree
zpe.thermalcorrenthalpy: 0.242452 hartree
zpe.thermalcorrgfe: 0.171647 hartree
zpe.sumelectzpe: -1061.510501 hartree
zpe.sumelectthermal: -1061.491823 hartree
zpe.sumelectthermalent: -1061.490879 hartree
zpe.sumelectthermalfe: -1061.561684 hartree
dipole: 1.2133 8.7088 -0.0232
dipole: 8.7930
quadrupole: -189.1289 -122.0231 -127.0699
quadrupole: -1.5235 5.0843 0.0178
quadrupole: -43.0549 24.0509 19.0040 -1.5235 5.0843 0.0178
hfenergy: -1061.7333312 hartree
pointgroup: C01 [X(C15H10N2O5)]
dipole: -0.4724831 -3.4266281 0.0507789 debye
polarizability: 415.7582122|2.0640776|210.9971606|2.2832104|-3.2541666|74.5940606 unknown
InChI: InChI=1S/C15H10N2O5/c18-15(12-4-2-6-14(10-12)17(21)22)8-7-11-3-1-5-13(9-11)16(19)20/h1-10H
charge 0 multiplicity 1
32 atoms
O  1.160787 1.832949 -0.173078
O  7.306645 0.267791 0.141214
O  6.007219 2.134352 0.311816
O  -7.396242 0.416469 -0.100108
O  -6.012629 2.210637 -0.363277
N  6.161765 0.863926 0.165668
N  -6.225367 0.952349 -0.177516
C  2.516354 -0.154366 -0.112663
C  -2.614426 -0.218331 0.002538
C  3.681101 0.643462 0.023287
C  -3.755037 0.620663 -0.12171
C  1.186306 0.56166 -0.111255
C  -1.284491 0.398465 -0.084011
C  4.940471 0.022413 0.014748
C  2.65757 -1.560479 -0.263253
C  -5.042287 0.057549 -0.043372
C  -2.821125 -1.615946 0.20782
C  -0.069283 -0.230991 -0.026483
C  5.096259 -1.37426 -0.134026
C  3.936487 -2.161383 -0.277547
C  -5.253169 -1.322576 0.158315
C  -4.119459 -2.155981 0.28414
H  3.585705 1.728165 0.12785
H  -3.650922 1.698868 -0.278375
H  -1.253608 1.491134 -0.208702
H  1.777893 -2.198537 -0.389736
H  -1.960038 -2.283986 0.313037
H  0.000132 -1.316131 0.098769
H  6.099437 -1.808273 -0.137103
H  4.028813 -3.244748 -0.402172
H  -6.272857 -1.712156 0.213308
H  -4.255005 -3.230204 0.443675
