program: Gaussian 09
title: 000298916
version: EM64L-G09RevD.01
frameworkgroup: C1[X(C14H10O2)]
method: RPBEPBE
basis: SDD
operation: Freq
keyword: #pfreq=noraman
keyword: PBEPBE/SDD
title: #p freq=noraman PBEPBE/SDD
converged: YES YES NO YES
title: Mulliken charges:
elementType: O O C C C C C C C C C C C C C C H H H H H H H H H H
charge: -0.431585 -0.423178 0.224871 0.240868 0.439981 0.229580 0.061766 -0.670090 -0.415076 0.055603 -0.373416 -0.384589 -0.234150 -0.385351 -0.256195 -0.237449 0.164529 0.227717 0.228257 0.280854 0.228915 0.251250 0.228521 0.232657 0.359595 0.356117
chargesum: 0.00000
title: Mulliken charges with hydrogens summed into heavy atoms:
elementType: O O C C C C C C C C C C C C C C
charge: -0.071990 -0.067062 0.224871 0.240868 0.439981 0.229580 0.061766 -0.505561 -0.187359 0.055603 -0.145160 -0.103736 -0.005235 -0.134101 -0.027674 -0.004792
polarizability: 2.55301786e+02 -3.25024287e+00 1.84694555e+02 4.14121047e-03 -1.92408537e-03 6.04917162e+01
1716.lowfreq: -97.0212 -8.1088 -3.2652 -0.0005 -0.0004 0.0005 2.9506 92.4137 99.6409
frequency: -97.0099 92.4108 99.6404 158.5646 212.2124 220.8336 240.6775 278.9100 334.1212 339.3088 360.9859 410.9454 414.6957 457.1283 483.1406 509.5623 537.9918 540.8359 586.7397 595.9631 615.5643 620.5763 692.2526 725.2512 765.9131 768.8248 779.4258 792.7186 833.0788 856.1468 882.0221 889.0979 900.2631 963.2992 970.6712 997.5403 1030.4695 1043.3493 1054.4084 1072.2159 1132.1789 1145.5727 1173.3936 1186.3384 1190.0906 1245.1961 1263.1838 1268.9038 1292.7374 1312.8153 1392.5044 1402.4774 1416.8782 1430.2623 1453.8477 1463.2435 1515.1517 1533.7295 1583.3986 1611.1142 1626.1302 1630.7821 3076.5651 3130.9512 3140.1095 3148.4853 3161.6129 3169.0885 3177.2009 3178.6751 3584.1245 3602.9156
redmass: 1.3052 3.9407 4.0798 4.3263 4.6540 5.3737 3.4950 5.6514 6.1632 1.8211 1.7426 7.0563 3.1187 5.5320 3.5038 6.1110 3.4999 7.3640 4.9536 3.1782 6.8026 3.4472 6.1526 1.8944 1.8163 5.8864 1.5869 1.6595 2.2043 4.3190 6.6146 1.3902 2.2719 1.3769 1.3587 1.3359 4.4177 2.8140 2.2983 2.4409 1.2971 1.4809 1.1209 1.2098 1.5799 1.7072 2.0461 1.8121 2.2220 2.7122 3.7275 6.0756 3.0034 2.5971 2.5135 3.2716 3.6761 4.5098 7.4901 6.2608 6.5181 7.2406 1.0891 1.0857 1.0869 1.0905 1.0954 1.0917 1.0976 1.0976 1.0660 1.0654
irintensity: 56.7313 14.9059 0.0053 14.5021 24.0265 0.8791 17.3357 8.9573 3.5561 21.3399 123.7066 2.1085 3.2399 12.3204 5.1479 4.5453 3.3982 3.1836 20.0178 0.2530 6.4082 2.3381 12.6338 0.0042 56.0929 5.4837 105.8804 55.2865 0.0094 0.4872 18.0837 1.4941 0.0029 0.0436 3.8667 0.1643 64.1738 92.1284 5.3869 32.7616 91.3645 188.5546 19.7301 37.8087 53.0404 2.8187 59.0453 4.1353 2.5668 40.9208 2.1140 6.8567 31.8905 11.5336 25.3830 25.7825 32.8345 36.8963 18.6534 72.8909 19.0598 14.0894 33.9299 2.5500 10.7721 14.8222 2.2509 21.8112 24.6603 12.8864 37.7502 18.9482
temp: 298.150 k
press: 1.00000 atm
elementType: 8 8 6 6 6 6 6 6 6 6 6 6 6 6 6 6 1 1 1 1 1 1 1 1 1 1
symmnumber: 1
zpe: 518984.4 jmol-1
zpe.correction: 0.197671 hartree
zpe.thermalcorrener: 0.209389 hartree
zpe.thermalcorrenthalpy: 0.210333 hartree
zpe.thermalcorrgfe: 0.160444 hartree
zpe.sumelectzpe: -688.862908 hartree
zpe.sumelectthermal: -688.851190 hartree
zpe.sumelectthermalent: -688.850246 hartree
zpe.sumelectthermalfe: -688.900135 hartree
dipole: -0.7683 1.2609 0.0004
dipole: 1.4766
quadrupole: -92.8945 -70.3689 -99.3654
quadrupole: 3.4316 -0.0027 0.0029
quadrupole: -5.3516 17.1740 -11.8224 3.4316 -0.0027 0.0029
hfenergy: -689.0605792 hartree
pointgroup: C01 [X(C14H10O2)]
dipole: -0.3011533 0.4967583 0.0038746 debye
dipolederiv: -0.4469918 0.543983 0.0069762 0.6744327 -1.225675 -0.0043956 0.0087587 -0.0057686 -0.4031291 -0.6148919 -0.5309725 -0.0089706 -0.8115086 -0.8979646 -0.0144026 -0.012693 -0.0116704 -0.4113071 0.022875 -0.0301658 -0.0001575 -0.1449398 0.0544173 -0.0006893 -0.0016799 0.0004046 -0.0007369 0.2581901 0.039321 0.0027256 0.015327 0.0056056 -0.0002303 0.002359 0.0000237 0.0315899 -0.0952885 -0.4412923 -0.0072902 -0.0894754 0.0484359 -0.0007774 -0.0027209 -0.0041939 0.0443811 0.061802 0.0025862 0.0005622 0.225146 -0.2227449 -0.0009145 0.0036342 -0.0031572 0.0096999 0.5308275 -0.5023933 -0.002188 -0.4518531 1.1891136 0.0107661 -0.0016107 0.0104292 0.0629178 -0.3645509 0.3736555 0.0041709 -0.0871458 -0.1537306 0.000719 -0.0019464 0.0052762 -0.2651877 -0.2287531 0.0825867 0.0007526 0.0608952 -0.0495076 0.0024851 0.0004781 0.0027167 -0.1856066 0.5149729 0.5752257 0.0121733 0.8410695 0.8379832 0.0186457 0.0156909 0.0160109 0.0455288 -0.1667808 -0.0752034 -0.0011343 -0.0520992 0.0511154 0.002167 -0.0008341 0.001959 -0.1519111 -0.0627787 -0.0028169 0.0007317 -0.1307793 0.0525613 0.0013467 -0.0009924 0.0026549 -0.142783 0.1123377 -0.0546929 0.0018546 0.1137814 0.1100504 0.004689 0.0040788 0.0030448 -0.1545812 0.0267864 0.083459 0.0031706 -0.2302164 -0.2171409 -0.0026178 -0.0009975 0.0004513 -0.1859331 -0.0179292 0.0803161 0.0023764 0.0376245 0.1083923 0.0038082 0.0018042 0.0042294 -0.1528715 0.0910744 -0.0471244 0.0018997 -0.01568 -0.0728692 0.0011109 0.0022991 0.0007974 -0.1687193 -0.0085881 -0.1250846 -0.0034941 -0.0824668 -0.1352564 -0.0050028 -0.0029741 -0.0054678 0.1716284 0.0496243 -0.114619 -0.0026003 -0.059289 -0.0456036 -0.0033046 -0.0018646 -0.003863 0.1545555 0.0703275 0.1053324 0.0006683 0.0476169 -0.0555336 -0.0021779 -0.0000864 -0.0016231 0.1442961 0.0775278 0.0404015 -0.0002831 0.083029 0.006314 -0.0012739 0.0003044 -0.0017218 0.1624111 0.0260808 0.0862089 -0.0001283 0.1093656 -0.0776054 -0.00211 0.0001961 -0.0023692 0.1580011 -0.0848862 0.0020275 -0.0024856 -0.0052817 0.1040065 -0.0010019 -0.0025381 -0.0009142 0.174549 0.0056265 -0.0959316 -0.0027624 -0.1218418 -0.0629386 -0.0041186 -0.0031014 -0.0038541 0.1582483 -0.1468698 0.0072713 -0.002912 0.0123512 0.0895247 -0.0008354 -0.0028181 -0.0008834 0.1614231 0.1082389 -0.1995745 -0.0054268 -0.1362187 0.3344782 -0.001983 -0.0045328 -0.0026453 0.3791952 0.2820174 0.1974966 0.0017711 0.1981569 0.224572 0.0000981 0.0017869 0.000134 0.3643413 unknown
polarizability: 255.268283|-3.4330804|184.6881272|1.8584169|1.6273031|60.5316476 unknown
InChI: InChI=1S/C14H10O2/c15-13-7-3-6-10-9-4-1-2-5-11(9)14(16)8-12(10)13/h1-8,15-16H
charge 0 multiplicity 1
26 atoms
O  -1.451527 3.013718 0.048357
O  3.596979 1.532101 0.077409
C  0.57551 -0.75633 0.017572
C  -0.890684 -0.676758 0.004265
C  1.334845 0.470231 0.041452
C  -1.546418 0.605559 0.014895
C  -0.734063 1.80481 0.039023
C  0.648842 1.741664 0.051909
C  1.27476 -1.999863 0.007661
C  2.771105 0.392807 0.054385
C  -1.721813 -1.839419 -0.019236
C  -2.97081 0.693615 0.002127
C  2.676383 -2.03902 0.020916
C  3.433607 -0.841161 0.044375
C  -3.119931 -1.741536 -0.031631
C  -3.753003 -0.466712 -0.020929
H  1.21374 2.685768 0.070501
H  0.7214 -2.941944 -0.010623
H  -1.266943 -2.833848 -0.027942
H  -3.431029 1.684991 0.010945
H  3.198148 -3.001655 0.013001
H  4.527166 -0.853246 0.054786
H  -3.728403 -2.652463 -0.049615
H  -4.84591 -0.396147 -0.030622
H  -0.839371 3.790287 0.065133
H  3.072317 2.368651 0.083186
