program: Gaussian 09
title: 000298972
version: EM64L-G09RevD.01
frameworkgroup: C1[X(C22H29N3)]
method: RPBEPBE
basis: SDD
operation: Freq
keyword: #pfreq=noraman
keyword: PBEPBE/SDD
title: #p freq=noraman PBEPBE/SDD
converged: YES YES NO NO
title: Mulliken charges:
elementType: N N N C C C C C C C C C C C C C C C C C C C C C C H H H H H H H H H H H H H H H H H H H H H H H H H H H H H
charge: -0.193473 -0.094539 -0.063481 -0.265089 -0.250665 -0.369196 0.453404 0.447661 -0.439289 -0.322871 -0.358513 -0.403664 -0.413017 -0.395021 -0.343857 -0.354181 -0.382420 -0.378525 -0.241292 -0.232514 -0.236305 -0.235667 -0.244842 -0.241536 -0.613893 0.226922 0.227025 0.253898 0.170217 0.198294 0.211587 0.218866 0.187512 0.241274 0.229429 0.227337 0.258590 0.196618 0.186728 0.185981 0.205746 0.204211 0.182639 0.185557 0.203540 0.223570 0.221832 0.222169 0.222545 0.225571 0.225318 0.221256 0.186503 0.222049
chargesum: 0.00000
title: Mulliken charges with hydrogens summed into heavy atoms:
elementType: N N N C C C C C C C C C C C C C C C C C C C C C C
charge: -0.193473 -0.094539 -0.063481 -0.038167 -0.023641 0.054919 0.453404 0.447661 -0.029408 0.083507 -0.117238 -0.174236 -0.185679 -0.136431 0.039489 0.037546 0.004430 0.010572 -0.017722 -0.010682 -0.014136 -0.013121 -0.019271 -0.016217 0.015914
polarizability: 2.78602171e+02 9.49253895e+00 2.42633507e+02 -2.44189375e+00 1.17591763e+01 2.32391907e+02
1716.lowfreq: -10.0906 -5.7149 0.0005 0.0007 0.0009 5.9774 10.8018 16.5069 27.3747
frequency: 10.0954 15.9874 27.3587 33.9039 36.9276 47.7986 60.0581 70.9780 100.6873 128.5616 149.8642 162.1611 196.8432 217.3898 222.4810 224.3773 254.9514 287.4801 319.5135 326.4845 343.2204 361.9756 370.6929 376.9102 395.0023 406.1701 409.4059 409.8892 471.6186 487.9334 491.3020 529.1797 541.1231 576.3935 595.1920 615.2092 616.6666 642.7463 697.0928 704.4966 712.2695 733.2058 754.9054 760.1066 765.0855 784.1585 835.8945 846.7046 852.0954 855.0042 861.0619 883.2662 901.0778 919.1582 926.1883 933.7088 947.9649 976.6579 983.7186 988.9475 989.6451 991.3638 994.2043 1000.5399 1012.0788 1013.8194 1025.5549 1026.6686 1043.2525 1049.4069 1060.9806 1066.7204 1074.7238 1080.4374 1081.3756 1094.7283 1104.2502 1125.1995 1139.2708 1146.0060 1148.9548 1168.6209 1169.2772 1170.3179 1179.4948 1183.0771 1191.9654 1196.1495 1220.1564 1222.5728 1257.7999 1263.3743 1279.1450 1280.7176 1295.6881 1304.9413 1306.9242 1318.5161 1330.8842 1340.9257 1349.7674 1355.5695 1365.9019 1369.1531 1372.2314 1380.1368 1386.3117 1390.3748 1401.5808 1428.9414 1438.8400 1443.5345 1451.9915 1453.2732 1456.7076 1459.4906 1465.3790 1467.4789 1473.1136 1477.9066 1481.2594 1484.9945 1486.4143 1589.4504 1590.4076 1615.5583 1616.2663 2842.5463 2845.0902 2855.9305 2860.7657 2863.8576 2876.4990 2882.0099 2989.8679 3011.6417 3015.4074 3022.2755 3026.0431 3026.8861 3029.4534 3030.9816 3039.4691 3043.0620 3051.9342 3073.7001 3111.4074 3113.7863 3123.2359 3124.5725 3136.8657 3138.1155 3150.2923 3155.6617 3162.3661 3168.5526
redmass: 4.5702 4.6326 3.8063 3.6660 3.7598 4.0998 3.8714 4.0391 3.7892 4.5223 3.9444 3.5742 2.9736 4.2821 1.5505 1.8754 1.8409 2.1676 2.4289 2.8020 2.9464 2.5266 3.5983 4.0788 2.6742 2.8475 2.8866 2.1210 2.7203 3.2180 2.8050 3.4015 3.2162 3.7220 2.2471 6.3565 6.3938 4.3875 4.8953 1.7381 1.6642 2.6808 3.0234 2.2842 2.0502 2.7233 1.9242 1.5518 1.2598 2.6394 1.3179 2.6020 4.1785 2.1775 1.4727 1.5643 2.3195 1.3806 1.4332 5.4149 3.2875 2.9339 1.3390 1.3687 2.3905 1.6429 2.0832 1.9391 2.0080 1.6100 1.7919 1.3861 1.7726 1.5427 1.5264 1.8449 2.3899 1.7973 2.2851 2.6425 2.7985 2.5301 1.0743 1.0871 1.1064 1.1192 1.2962 1.2333 2.0116 1.2800 1.9291 1.4522 1.4699 1.3973 1.2971 1.2930 1.4499 1.4083 1.3111 1.3198 1.3826 1.4834 1.8860 1.4367 1.4156 5.5094 1.6365 2.9710 2.2182 1.1680 2.1496 2.0638 1.0812 1.0788 1.0916 1.0683 1.0823 1.1239 1.1021 1.1107 1.0536 2.4580 2.5307 6.1166 6.1055 6.1817 6.1146 1.0699 1.0639 1.0685 1.0700 1.0668 1.0677 1.0699 1.0611 1.0831 1.0725 1.0886 1.0912 1.0879 1.0928 1.0888 1.0878 1.0893 1.0957 1.1009 1.0870 1.0865 1.0867 1.0867 1.0924 1.0929 1.0951 1.0968 1.1009 1.0975
irintensity: 0.0155 0.0155 0.0295 0.0103 0.0295 0.1468 0.0387 0.1358 0.7042 0.2622 6.0026 5.0045 0.2472 1.6870 0.2343 0.5705 0.3588 1.8672 10.3937 0.0332 8.9000 1.0152 0.5252 0.2395 1.5075 0.0559 0.1085 0.2078 3.3198 4.6628 0.8648 21.7606 5.6581 6.7544 0.2558 0.1533 0.0845 2.2569 10.7730 63.7961 59.1108 8.4764 17.9793 18.0056 33.1854 9.2509 2.8332 0.2979 0.1389 7.0201 1.1143 1.1405 0.7376 5.2854 2.7816 5.7081 21.1356 0.1545 0.2890 0.0592 9.9334 14.5897 0.8471 3.8675 25.6685 3.8422 7.9908 8.4032 14.3559 3.8205 5.5595 2.6459 5.6297 3.9649 4.0452 22.4678 9.5188 11.3231 8.6724 25.6454 53.9387 43.0168 1.2722 2.8077 1.3298 2.4236 0.1910 1.3989 1.2457 27.9429 4.7286 5.3773 16.1388 14.7324 32.6489 0.2694 1.0710 8.7441 5.6850 11.3174 15.9794 10.0900 2.0455 2.8263 4.6075 5.8756 2.0905 1.6109 26.4709 1.7911 5.3602 22.5715 3.1779 0.1815 10.4235 21.6730 19.9035 2.2468 26.8397 6.0540 8.2300 21.9919 12.4463 0.0791 2.0091 13.9241 7.2455 72.2964 50.3545 64.0199 23.0978 35.5362 385.7560 68.5221 36.7848 6.1896 49.3017 36.8444 83.1745 43.4482 2.0360 40.7120 25.2525 29.9374 75.0018 35.7516 8.0193 7.5084 0.6345 0.9104 15.6130 41.0926 29.6371 41.6285 20.1909 11.3965
temp: 298.150 k
press: 1.00000 atm
elementType: 7 7 7 6 6 6 6 6 6 6 6 6 6 6 6 6 6 6 6 6 6 6 6 6 6 1 1 1 1 1 1 1 1 1 1 1 1 1 1 1 1 1 1 1 1 1 1 1 1 1 1 1 1 1
symmnumber: 1
zpe: 1214995.3 jmol-1
zpe.correction: 0.462767 hartree
zpe.thermalcorrener: 0.486109 hartree
zpe.thermalcorrenthalpy: 0.487053 hartree
zpe.thermalcorrgfe: 0.406012 hartree
zpe.sumelectzpe: -1018.056687 hartree
zpe.sumelectthermal: -1018.033346 hartree
zpe.sumelectthermalent: -1018.032401 hartree
zpe.sumelectthermalfe: -1018.113442 hartree
dipole: 0.4021 -0.1983 -1.3726
dipole: 1.4440
quadrupole: -144.9455 -148.8212 -138.7931
quadrupole: 2.8212 0.1106 5.6016
quadrupole: -0.7589 -4.6346 5.3935 2.8212 0.1106 5.6016
hfenergy: -1018.5194542 hartree
pointgroup: C01 [X(C22H29N3)]
dipole: 0.1526105 -0.1091044 -0.5362348 debye
polarizability: 279.6378646|7.1231937|242.5247435|-2.0286413|11.4793936|231.4649761 unknown
InChI: InChI=1S/C22H29N3/c1-23-15-17-24(18-16-23)13-8-14-25-21(19-9-4-2-5-10-19)22(25)20-11-6-3-7-12-20/h2-7,9-12,21-22H,8,13-18H2,1H3
charge 0 multiplicity 1
54 atoms
N  -0.392007 -0.294027 -0.928302
N  3.232166 -0.921662 0.080854
N  5.915265 0.062378 0.590253
C  -1.740529 -0.866713 -1.247229
C  -1.377727 0.613531 -1.583464
C  0.752766 -0.768471 -1.755514
C  -2.660069 -1.295647 -0.150545
C  -1.893671 1.810157 -0.846637
C  1.352472 -2.054227 -1.157156
C  2.042839 -1.802453 0.201774
C  -2.363055 -1.063339 1.216622
C  -2.94598 2.576134 -1.41342
C  -3.872579 -1.955467 -0.48495
C  -1.344119 2.212828 0.395664
C  4.425249 -1.620532 -0.456386
C  3.574539 -0.239523 1.353958
C  5.577555 -0.626804 -0.677367
C  4.724889 0.757041 1.135501
C  -3.258595 -1.480837 2.225094
C  -3.444047 3.716619 -0.747589
C  -4.770306 -2.369478 0.522557
C  -1.837517 3.357587 1.060132
C  -4.466627 -2.132375 1.88385
C  -2.89113 4.111843 0.493742
C  7.077224 0.959515 0.451679
H  -1.795458 -1.496412 -2.152626
H  -1.249431 0.772059 -2.669095
H  1.524286 0.023162 -1.747207
H  0.441325 -0.950214 -2.813492
H  2.074325 -2.481619 -1.880109
H  0.553478 -2.809773 -1.019967
H  1.314115 -1.299145 0.863382
H  2.30447 -2.781628 0.676758
H  -1.418922 -0.571734 1.470023
H  -3.376625 2.274788 -2.37679
H  -4.111794 -2.14439 -1.539475
H  -0.519416 1.624839 0.811972
H  4.167883 -2.09518 -1.420742
H  4.771788 -2.425031 0.241766
H  3.881451 -0.970141 2.144653
H  2.681076 0.303716 1.714127
H  6.472353 -1.171843 -1.033451
H  5.275031 0.101987 -1.473528
H  4.371521 1.567829 0.447058
H  4.998037 1.222681 2.101442
H  -3.014587 -1.298651 3.278003
H  -4.25924 4.29742 -1.194245
H  -5.701787 -2.878194 0.248851
H  -1.399625 3.66269 2.017592
H  -5.161291 -2.45525 2.667544
H  -3.275492 4.998698 1.01029
H  7.952665 0.383848 0.100351
H  6.905567 1.801228 -0.267704
H  7.328588 1.397481 1.434595
