program: Gaussian 09
title: 000298970
version: EM64L-G09RevD.01
frameworkgroup: C1[X(C21H32N2)]
method: RPBEPBE
basis: SDD
operation: Freq
keyword: #pfreq=noraman
keyword: PBEPBE/SDD
title: #p freq=noraman PBEPBE/SDD
converged: NO YES NO NO
title: Mulliken charges:
elementType: N N C C C C C C C C C C C C C C C C C C C C C H H H H H H H H H H H H H H H H H H H H H H H H H H H H H H H H
charge: -0.079457 -0.561517 0.291188 -0.060539 -0.496654 0.345004 -0.549961 -0.400337 -0.405125 -0.786379 0.137843 -0.405850 -0.730552 0.387892 -0.288561 -0.346409 -0.299866 -0.482743 -0.639905 -0.443870 -0.307572 -0.705212 -0.252613 0.216811 0.192007 0.220824 0.228113 0.214880 0.231026 0.194759 0.238291 0.191829 0.245664 0.221521 0.196999 0.251205 0.215372 0.215342 0.216578 0.264770 0.267406 0.224998 0.228663 0.216615 0.168401 0.239016 0.212549 0.185503 0.234888 0.237949 0.227329 0.210974 0.213294 0.228117 0.229504
chargesum: 0.00000
title: Mulliken charges with hydrogens summed into heavy atoms:
elementType: N N C C C C C C C C C C C C C C C C C C C C C
charge: -0.079457 -0.029340 0.291188 0.156272 -0.083823 0.345004 -0.106968 0.025447 0.024995 -0.122194 0.137843 -0.154644 -0.083261 0.387892 -0.063564 -0.117746 0.085150 -0.243727 -0.006966 -0.205922 -0.080243 -0.052828 -0.023108
polarizability: 2.18370517e+02 1.74770531e+01 2.68360836e+02 1.25294285e+01 -1.29688110e+01 2.39038425e+02
1716.lowfreq: -39.0770 -8.8490 -0.0007 0.0005 0.0006 4.8852 9.6149 19.2155 35.6052
frequency: -37.0957 17.7971 35.5266 42.8725 48.2745 53.7150 73.7526 86.7704 110.2141 121.8311 132.2621 155.0888 168.9895 186.9159 196.7465 201.4351 217.8420 233.9905 248.2070 253.2347 257.3495 282.8604 296.5246 313.6817 335.2672 342.9075 349.3598 360.7959 398.2896 419.7786 424.6716 433.5134 459.7456 471.2409 479.6575 503.9271 514.6338 536.4287 544.8318 596.8379 634.0520 661.5340 706.2099 730.5576 743.6082 774.8305 777.4737 783.0704 786.2435 796.5653 804.8800 813.4562 828.4014 853.5411 874.4805 886.3022 912.8510 942.9418 952.7621 962.5209 964.6175 984.0225 985.1469 990.5512 996.3661 1024.4631 1037.0572 1042.1633 1049.3522 1058.1244 1061.9394 1080.3642 1096.1680 1097.5806 1103.6315 1119.9265 1128.7552 1145.0742 1150.8654 1156.7307 1170.3893 1176.1658 1180.8789 1195.1993 1216.3142 1227.0435 1239.8867 1253.0826 1263.3293 1269.7904 1287.8753 1291.4822 1311.6702 1318.4913 1330.9931 1343.6596 1348.1360 1351.6517 1362.2235 1365.3186 1379.5032 1385.8564 1391.2316 1396.9483 1397.0578 1405.3052 1430.6779 1438.6078 1452.8380 1457.5768 1462.4488 1465.6047 1470.2951 1472.5434 1474.8880 1475.2886 1479.3678 1485.1826 1487.9921 1489.6730 1492.1239 1497.9269 1517.2823 1581.8426 1603.7215 1628.2554 1639.3484 2829.5317 2840.1583 2856.6305 2958.9590 2973.0666 2984.0103 2984.9102 2996.4190 2998.3035 3000.3250 3016.8213 3021.9978 3034.9516 3039.2795 3059.7868 3064.7030 3066.7927 3068.4780 3073.2413 3077.9165 3084.6725 3086.9464 3090.2130 3118.3756 3121.6004 3132.7254 3145.6087 3156.5686 3178.7432 3202.1435 3493.9413 3624.8523
redmass: 1.5510 3.0519 3.3086 3.5461 3.5417 2.5537 2.8157 2.5814 1.8213 2.0484 2.4382 2.2317 2.8685 3.1959 1.2027 1.9491 2.2422 1.7471 2.0084 2.1943 1.9630 2.6524 2.5155 2.8205 2.4983 2.1712 2.1204 2.3941 2.5334 2.3319 3.1423 3.1076 2.3401 3.1063 2.9664 2.0575 6.5479 2.5257 4.0700 3.1826 5.0837 3.1548 2.7765 2.7266 1.3042 1.6202 1.6049 3.6711 2.1043 1.6295 1.2714 1.8654 2.1439 1.6479 1.6770 2.4556 1.5019 1.9461 1.8307 1.5299 1.2880 1.4446 2.0784 1.4920 1.9150 2.3489 2.4110 2.2415 2.5285 2.4240 1.9970 2.5215 1.5327 2.2324 2.8409 1.8025 2.2085 1.8267 1.6439 2.2213 1.6761 1.2652 1.6058 1.8059 2.0332 2.1377 1.8324 1.5667 1.5171 1.3481 1.2062 1.3322 1.2566 1.2452 1.3025 1.3455 1.3949 1.5563 1.4976 1.2543 1.2366 1.2163 1.3121 2.4106 1.3695 2.9555 1.1636 2.3540 1.8328 1.0810 1.1347 1.0485 1.0633 1.0703 1.0625 1.0517 1.0750 1.0690 1.0896 1.0669 1.0597 1.0795 3.4094 6.4682 5.3601 6.2823 1.0943 1.0705 1.0618 1.0673 1.0616 1.0359 1.0372 1.0355 1.0655 1.0634 1.0788 1.0878 1.0983 1.0707 1.0845 1.1005 1.0977 1.0966 1.0993 1.0990 1.0988 1.0974 1.0997 1.0998 1.0867 1.0860 1.0904 1.0962 1.0986 1.0928 1.0912 1.0445 1.0986
irintensity: 1.3443 0.1825 0.0683 0.1881 0.2988 0.2860 0.4061 0.3462 2.7225 1.5478 3.5718 1.2505 0.2668 4.1488 0.7448 8.8774 0.2046 2.4990 7.5117 0.8787 0.6730 3.3777 3.9950 0.8769 1.0404 4.8836 3.0431 9.0373 41.0554 23.9961 8.5930 12.0061 48.4945 5.5602 0.3534 205.3469 4.6049 71.6266 21.9403 3.0177 7.8212 2.9834 4.4254 12.1572 7.4043 4.8723 16.1273 5.7785 39.4328 53.9442 10.9407 34.1146 11.0196 1.0536 4.6050 1.8880 0.3036 11.9809 8.6381 7.9328 1.5741 1.9563 9.5873 0.8133 1.8856 5.3583 5.5771 22.0493 35.6411 16.1957 16.8893 5.6679 4.1060 6.3200 18.9514 3.6049 11.1539 5.5489 9.4160 6.4634 8.6797 3.5099 2.2001 5.9084 11.4235 3.7666 0.8546 3.1788 1.2808 0.8589 7.9232 0.8382 4.2749 11.5333 0.7642 14.6906 11.0831 0.7754 3.0388 2.2287 10.7025 14.4714 13.7006 3.1439 18.9467 10.9214 6.9428 6.8251 2.0620 3.2494 0.8852 8.3208 4.5211 3.3659 7.5731 8.5767 6.5438 15.0149 8.8697 25.8761 4.9144 6.1533 10.5221 7.6009 3.8847 0.2618 34.5017 68.0410 81.7456 149.5589 26.5565 32.3868 43.1033 34.2646 28.8964 36.2720 6.6035 15.3063 16.0931 45.8636 12.1510 27.1684 6.7844 63.7748 71.1864 41.0966 58.9570 40.7708 22.9776 52.8928 1.9041 2.9580 14.8905 34.8739 38.9375 13.7854 11.9298 0.1724 1.3571
temp: 298.150 k
press: 1.00000 atm
elementType: 7 7 6 6 6 6 6 6 6 6 6 6 6 6 6 6 6 6 6 6 6 6 6 1 1 1 1 1 1 1 1 1 1 1 1 1 1 1 1 1 1 1 1 1 1 1 1 1 1 1 1 1 1 1 1
symmnumber: 1
zpe: 1268954.3 jmol-1
zpe.correction: 0.483319 hartree
zpe.thermalcorrener: 0.507712 hartree
zpe.thermalcorrenthalpy: 0.508656 hartree
zpe.thermalcorrgfe: 0.429311 hartree
zpe.sumelectzpe: -927.130313 hartree
zpe.sumelectthermal: -927.105920 hartree
zpe.sumelectthermalent: -927.104976 hartree
zpe.sumelectthermalfe: -927.184321 hartree
dipole: -0.1875 0.3484 -0.3739
dipole: 0.5444
quadrupole: -141.3717 -136.7889 -139.9269
quadrupole: 2.9969 0.5628 4.3264
quadrupole: -2.0092 2.5736 -0.5644 2.9969 0.5628 4.3264
hfenergy: -927.6136322 hartree
pointgroup: C01 [X(C21H32N2)]
dipole: 0.0465283 -0.1438627 -0.1516849 debye
polarizability: 225.0673073|25.2910833|260.509459|-9.2665143|14.8268233|240.1930121 unknown
InChI: InChI=1S/C21H32N2/c1-5-17(3)21(16-22,14-15-23(4)6-2)20-13-9-11-18-10-7-8-12-19(18)20/h7-13,17H,5-6,14-16,22H2,1-4H3
charge 0 multiplicity 1
55 atoms
N  3.525939 -0.390636 -0.299492
N  1.208827 3.58222 1.083367
C  0.051353 1.38958 0.202052
C  -0.899431 2.13636 -0.849777
C  1.401397 0.939103 -0.46476
C  -0.740323 0.160275 0.764426
C  0.437747 2.371886 1.391726
C  -2.080365 2.8732 -0.153668
C  2.198514 -0.127004 0.320177
C  -0.188898 3.067415 -1.869344
C  -1.17011 -0.964496 -0.068762
C  -1.0826 0.109162 2.12831
C  -3.240457 3.221391 -1.113313
C  -1.930922 -2.052139 0.534264
C  -1.823029 -0.961319 2.71432
C  -0.887996 -1.092907 -1.476669
C  4.039875 -1.745851 0.03581
C  -2.24724 -2.027357 1.930689
C  4.50645 0.673107 0.002132
C  -2.364646 -3.163911 -0.26354
C  -1.317442 -2.188999 -2.228354
C  5.247352 -2.170112 -0.821103
C  -2.069643 -3.240438 -1.62326
H  -1.369244 1.335396 -1.452692
H  2.023424 1.845819 -0.593451
H  1.255842 0.546911 -1.484776
H  -0.4822 2.704325 1.902621
H  1.02102 1.800202 2.138165
H  -2.474399 2.231659 0.658761
H  -1.71868 3.806842 0.32497
H  1.629903 -1.07382 0.31145
H  2.301056 0.170951 1.395338
H  0.694775 2.591301 -2.327574
H  -0.883445 3.318709 -2.692053
H  0.139913 4.021459 -1.419247
H  -0.781611 0.915088 2.799555
H  -2.928589 3.934959 -1.897612
H  -3.621891 2.311657 -1.614941
H  -4.082902 3.679946 -0.563272
H  2.17596 3.443348 0.785459
H  0.721399 4.297091 0.541827
H  -2.052699 -0.928806 3.785135
H  -0.312788 -0.322646 -1.989564
H  3.213193 -2.459243 -0.1418
H  4.309884 -1.826435 1.122408
H  -2.820027 -2.856791 2.362137
H  4.098375 1.656957 -0.28701
H  4.779473 0.716253 1.08878
H  5.431003 0.519957 -0.579121
H  -2.936454 -3.961225 0.226901
H  -1.072087 -2.240757 -3.295006
H  5.493778 -3.230463 -0.62811
H  6.151882 -1.575786 -0.599808
H  5.009777 -2.05498 -1.893619
H  -2.404991 -4.094209 -2.221979
