program: Gaussian 09
title: 000026919
version: EM64L-G09RevD.01
frameworkgroup: C1[X(C18H30)]
method: RPBEPBE
basis: SDD
operation: Freq
keyword: #p
keyword: freq=noraman
keyword: PBEPBE/SDD
title: #p freq=noraman PBEPBE/SDD
converged: YES YES NO NO
title: Mulliken charges:
elementType: C C C C C C C C C C C C C C C C C C H H H H H H H H H H H H H H H H H H H H H H H H H H H H H H
charge: 0.356583 0.364175 -0.601614 -0.588681 0.518136 -0.620015 -0.365044 -0.570912 -0.362697 -0.429123 -0.356146 -0.453802 -0.341267 -0.342485 -0.340175 -0.698103 -0.698021 -0.696245 0.205264 0.209034 0.203481 0.206935 0.240164 0.200348 0.205233 0.200655 0.200312 0.206196 0.199052 0.230461 0.204617 0.202866 0.230262 0.194267 0.194438 0.194299 0.194733 0.193670 0.194547 0.215796 0.211118 0.211803 0.212200 0.210866 0.215599 0.211390 0.210601 0.215228
chargesum: 0.00000
title: Mulliken charges with hydrogens summed into heavy atoms:
elementType: C C C C C C C C C C C C C C C C C C
charge: 0.356583 0.364175 -0.187315 -0.178265 0.518136 -0.379851 0.040537 -0.169944 0.042551 -0.198662 0.051337 -0.223540 0.047438 0.046547 0.048042 -0.059386 -0.059356 -0.059026
polarizability: 2.51178949e+02 5.52947042e+00 1.94546353e+02 -7.64740156e+00 1.24279082e+01 1.51088322e+02
1716.lowfreq: -3.7859 -0.0007 0.0006 0.0009 4.6849 7.8138 14.6961 28.4449 30.0100
frequency: 14.3074 28.4073 29.9746 44.9114 61.6853 71.2022 76.1657 78.0187 79.7559 108.0930 123.2027 125.9755 160.2143 204.4064 213.1146 225.6086 228.6021 232.7796 251.1076 276.9532 294.6701 312.5570 333.7921 379.6992 382.1398 435.6532 441.5506 489.9201 553.4298 596.4543 635.5310 725.4464 730.6544 732.9441 734.2107 753.6812 776.4694 787.3509 789.0029 799.6126 837.7671 885.9822 892.5289 900.8115 908.0688 916.5189 919.4064 923.9440 945.8809 959.9017 1007.9152 1009.4388 1012.7103 1049.2716 1067.1360 1067.7033 1068.5164 1077.6814 1088.6036 1102.8848 1105.4536 1106.2234 1140.3526 1167.0647 1203.4746 1204.7236 1206.3304 1217.0411 1243.9630 1249.9646 1253.5299 1258.8363 1268.1018 1273.8784 1275.4735 1284.2088 1286.5097 1288.1333 1302.3981 1318.2437 1319.8565 1324.4737 1343.8415 1346.9900 1347.5550 1379.6788 1388.5711 1388.8424 1389.3480 1416.2169 1460.9748 1465.1750 1466.6957 1468.9292 1470.2012 1473.6949 1476.5062 1477.1990 1477.2150 1479.4098 1480.7496 1484.9254 1488.3668 1489.0495 1493.0773 1497.9112 1581.6142 1620.7176 2960.5564 2960.6818 2961.3350 2966.9320 2968.2205 2969.3584 2972.2098 2972.3579 2972.5840 2976.4391 2979.5585 2982.7797 2999.4131 2999.7181 3000.3506 3017.8811 3018.0739 3021.0732 3041.6576 3043.9126 3047.1941 3068.8470 3069.2072 3069.9639 3070.7918 3070.8295 3070.9575 3096.7108 3103.5177 3129.7674
redmass: 3.3135 3.5825 3.5893 2.6787 1.7683 1.7530 2.3318 2.0635 2.6617 2.2506 2.3288 2.2165 3.3708 3.1612 3.3397 1.1307 1.1592 1.1197 2.6441 2.7381 3.2723 3.3184 2.5282 2.9453 2.9875 2.9918 2.4592 3.0258 4.3209 4.8178 4.3008 1.4610 1.3897 1.0824 1.4913 2.7066 2.1131 1.3277 1.2120 1.4734 1.4985 1.6003 1.8131 1.7693 1.4491 1.3592 1.4894 1.2762 2.2837 1.4081 4.1871 4.0969 3.6111 1.5692 2.5019 2.5379 2.5557 1.3299 1.3933 2.1487 2.1796 2.2171 1.8422 1.4855 1.5327 1.4827 1.4833 1.7028 1.6576 1.3540 1.3207 1.5698 1.3730 1.3011 1.2814 1.0722 1.0682 1.0774 1.2322 1.4067 1.3882 1.5309 1.5743 1.5736 1.5745 5.4865 1.2140 1.2135 1.2144 3.1471 1.0864 1.0744 1.0698 1.0702 1.0799 1.0754 1.0423 1.0425 1.0424 1.0718 1.0726 1.0809 1.0888 1.0897 1.1958 2.3674 6.8397 6.6244 1.0585 1.0586 1.0585 1.0591 1.0590 1.0584 1.0368 1.0373 1.0369 1.0590 1.0595 1.0604 1.0985 1.0985 1.0987 1.1021 1.1016 1.1012 1.1047 1.1046 1.1034 1.1007 1.1007 1.1007 1.0994 1.0994 1.0993 1.0905 1.0867 1.0966
irintensity: 0.0131 0.0961 0.0430 0.0549 0.0177 0.0287 0.0403 0.0271 0.0038 0.0724 0.0154 0.0516 0.0399 0.7561 0.0221 0.0260 0.0548 0.0099 0.3156 0.2604 0.0810 0.3056 0.0864 0.2211 0.0523 0.1279 0.2359 11.0014 3.6920 2.0558 4.1286 4.1416 7.3410 6.2725 4.2210 2.8259 0.1415 1.7257 0.5048 1.0111 27.4319 2.5451 1.4414 10.2498 0.4132 4.7894 4.0821 0.6927 4.4838 0.4756 0.1693 0.1716 3.4327 1.9050 2.3276 1.6311 2.1635 3.1929 1.0310 11.9353 24.9297 16.9086 1.8355 4.1602 0.6033 1.9716 0.0377 0.6833 2.3392 2.1362 1.7840 1.0400 1.2107 1.5471 1.2816 0.5388 0.6748 0.0332 0.5470 1.2776 0.3461 1.6160 0.4922 0.3356 0.8946 0.4158 11.4168 11.4138 12.2580 3.5007 3.7663 0.0455 0.1949 0.7432 0.8491 1.3508 12.4666 12.9298 11.6138 3.9253 2.8719 4.7827 18.2730 24.1380 18.8928 24.8432 3.2899 7.7693 20.0616 13.3889 14.0536 0.9916 6.9892 12.3727 63.0204 20.8662 28.9405 101.9525 106.0595 57.1978 3.1040 2.2802 3.4251 0.4447 1.4848 1.1029 63.6926 54.5099 29.1606 105.8259 46.0680 93.7067 80.1219 64.2750 30.4934 26.5394 17.4287 27.6837
temp: 298.150 k
press: 1.00000 atm
elementType: 6 6 6 6 6 6 6 6 6 6 6 6 6 6 6 6 6 6 1 1 1 1 1 1 1 1 1 1 1 1 1 1 1 1 1 1 1 1 1 1 1 1 1 1 1 1 1 1
symmnumber: 1
zpe: 1134637.0 jmol-1
zpe.correction: 0.432160 hartree
zpe.thermalcorrener: 0.454015 hartree
zpe.thermalcorrenthalpy: 0.454959 hartree
zpe.thermalcorrgfe: 0.378061 hartree
zpe.sumelectzpe: -702.500821 hartree
zpe.sumelectthermal: -702.478967 hartree
zpe.sumelectthermalent: -702.478023 hartree
zpe.sumelectthermalfe: -702.554920 hartree
dipole: 0.1866 0.3794 0.0329
dipole: 0.4241
quadrupole: -108.7663 -111.9730 -114.9163
quadrupole: 1.2147 -2.3100 4.2188
quadrupole: 3.1189 -0.0878 -3.0311 1.2147 -2.3100 4.2188
hfenergy: -702.9329813 hartree
pointgroup: C01 [X(C18H30)]
dipole: -0.079516 -0.1462907 0.0107027 debye
polarizability: 251.589318|2.9943539|194.6089075|6.824292|-11.9992913|150.6153987 unknown
InChI: InChI=1S/C18H30/c1-4-7-10-16-13-14-17(11-8-5-2)18(15-16)12-9-6-3/h13-15H,4-12H2,1-3H3
charge 0 multiplicity 1
48 atoms
C  -0.397056 -0.133024 0.39074
C  -0.917628 0.880286 -0.471836
C  -1.238962 -1.320091 0.844226
C  -2.377847 0.910772 -0.908155
C  1.827506 0.978028 0.378136
C  0.958807 -0.059258 0.797112
C  -1.178029 -2.512296 -0.152345
C  3.290216 0.993248 0.797001
C  -3.29956 1.630858 0.116658
C  -0.049704 1.920438 -0.890419
C  4.19075 0.128512 -0.129187
C  1.2984 1.975419 -0.477966
C  -2.038142 -3.715288 0.2954
C  -4.781237 1.65683 -0.321374
C  5.675941 0.138297 0.297206
C  -1.968309 -4.901839 -0.690077
C  -5.693291 2.380161 0.692939
C  6.568603 -0.725085 -0.620264
H  -2.297865 -1.028732 0.980965
H  -0.881293 -1.673746 1.831514
H  -2.764451 -0.113359 -1.074215
H  -2.460469 1.436464 -1.88007
H  1.348554 -0.838887 1.466727
H  -1.509488 -2.172099 -1.15467
H  -0.122704 -2.831441 -0.2692
H  3.394039 0.618707 1.835222
H  3.674409 2.032634 0.793084
H  -2.935069 2.667706 0.262402
H  -3.21393 1.13313 1.104153
H  -0.444398 2.703003 -1.55132
H  4.099655 0.496109 -1.171365
H  3.811944 -0.913765 -0.133699
H  1.943175 2.795408 -0.818663
H  -1.706432 -4.046956 1.300915
H  -3.092271 -3.388173 0.409164
H  -5.137601 0.615942 -0.465414
H  -4.860424 2.151198 -1.311442
H  5.757677 -0.223275 1.343006
H  6.047584 1.183634 0.300673
H  -2.592743 -5.748606 -0.350239
H  -2.321048 -4.603143 -1.695299
H  -0.929837 -5.268425 -0.795862
H  -5.37754 3.43161 0.829955
H  -5.65324 1.887853 1.682984
H  -6.747562 2.38439 0.359818
H  6.52466 -0.367171 -1.666223
H  6.238589 -1.781127 -0.614429
H  7.62602 -0.699548 -0.298165
