program: Gaussian 09
title: 000298908
version: EM64L-G09RevD.01
frameworkgroup: C1[X(C14H8O3)]
method: RPBEPBE
basis: SDD
operation: Freq
keyword: #pfreq=noraman
keyword: PBEPBE/SDD
title: #p freq=noraman PBEPBE/SDD
converged: YES YES NO YES
title: Mulliken charges:
elementType: O O O C C C C C C C C C C C C C C H H H H H H H H
charge: -0.424328 -0.177037 -0.202093 0.120475 0.163814 0.440792 0.213228 -0.458561 -0.417034 0.211328 0.025305 -0.465554 0.001017 -0.418911 -0.250918 -0.208857 -0.285173 0.250071 0.287391 0.248529 0.224156 0.260705 0.233064 0.263463 0.365127
chargesum: 0.00000
title: Mulliken charges with hydrogens summed into heavy atoms:
elementType: O O O C C C C C C C C C C C C C C
charge: -0.059201 -0.177037 -0.202093 0.120475 0.163814 0.440792 0.213228 -0.208490 -0.129642 0.211328 0.025305 -0.217025 0.001017 -0.194755 0.009788 0.024207 -0.021710
polarizability: 2.48795468e+02 9.62577385e+00 1.89918398e+02 8.40012711e+00 -6.76846747e-01 6.72826500e+01
1716.lowfreq: -12.4177 -4.5322 0.0006 0.0008 0.0009 4.6629 69.0465 74.3802 112.1152
frequency: 69.0443 74.3790 112.1144 176.6843 187.5723 221.1779 253.3834 264.7253 276.6708 310.3521 324.2729 393.8209 429.0988 463.6708 477.7492 482.8933 493.1365 519.0258 568.3937 578.3619 590.5327 626.1975 639.1891 666.4239 734.3342 757.0642 773.7628 779.3129 825.4503 838.3045 856.7134 877.4281 890.9491 939.1704 967.7375 992.8372 1004.1868 1038.8862 1059.6272 1092.8445 1134.5905 1163.0021 1167.9835 1192.6426 1215.4793 1249.6564 1270.9338 1302.0106 1346.0973 1368.8222 1401.5404 1406.0527 1425.2057 1459.7545 1510.3556 1534.3330 1556.4096 1562.0024 1595.8710 1614.3115 1628.9632 3122.2590 3135.6852 3140.2712 3142.4028 3164.5168 3165.8048 3168.7532 3586.0177
redmass: 5.8225 7.2518 7.8061 5.4658 5.0509 5.8532 3.7325 2.0304 3.7487 3.9081 3.7634 6.2379 6.7604 4.8548 5.2636 5.0710 4.3133 7.2109 4.1974 4.9408 4.1301 3.4628 3.6969 6.4456 3.2626 2.4211 5.9757 2.1702 5.5008 1.7133 1.7006 6.0394 1.6303 4.9456 1.3385 1.3189 1.3708 3.3676 2.2958 1.9887 1.6492 1.5185 1.1495 1.4258 2.1921 1.9858 2.2052 3.2164 2.0295 4.4030 5.8015 5.3970 2.2999 2.9655 4.9573 10.9411 7.2065 8.0234 6.6487 7.0333 7.3792 1.0888 1.0891 1.0891 1.0866 1.0992 1.0968 1.1008 1.0662
irintensity: 6.5359 0.0846 5.2178 2.7719 9.2072 2.3218 15.9064 49.3980 14.6529 23.5024 17.4894 16.8060 1.5246 6.5594 6.0099 6.0983 1.6537 5.1504 0.8620 4.8609 4.5047 9.0444 2.4984 1.9351 21.3882 26.8400 11.7344 5.4454 13.8669 90.2860 5.8743 2.1340 25.0674 25.5462 1.7477 1.0282 0.2754 74.3892 50.3364 30.6584 33.4365 11.8950 28.7180 53.7156 24.2965 5.6333 40.4816 187.4858 19.0389 8.8831 35.3230 10.8347 41.7952 20.1339 61.2640 100.5612 70.9897 136.2424 4.7119 23.9637 10.8642 11.3705 3.4165 9.3353 0.5837 15.5908 20.9428 8.8172 44.9470
temp: 298.150 k
press: 1.00000 atm
elementType: 8 8 8 6 6 6 6 6 6 6 6 6 6 6 6 6 6 1 1 1 1 1 1 1 1
symmnumber: 1
zpe: 468692.1 jmol-1
zpe.correction: 0.178515 hartree
zpe.thermalcorrener: 0.191369 hartree
zpe.thermalcorrenthalpy: 0.192314 hartree
zpe.thermalcorrgfe: 0.139609 hartree
zpe.sumelectzpe: -762.798887 hartree
zpe.sumelectthermal: -762.786033 hartree
zpe.sumelectthermalent: -762.785088 hartree
zpe.sumelectthermalfe: -762.837793 hartree
dipole: 3.9159 0.5547 -0.9370
dipole: 4.0644
quadrupole: -85.0079 -89.7064 -102.3115
quadrupole: -6.4702 -1.6801 -6.5045
quadrupole: 7.3340 2.6355 -9.9696 -6.4702 -1.6801 -6.5045
hfenergy: -762.977402 hartree
pointgroup: C01 [X(C14H8O3)]
dipole: 1.5413797 0.2375416 -0.3532257 debye
dipolederiv: -0.1364529 0.2849849 -0.0174679 0.0967029 -1.0877236 0.2877831 0.1273384 0.3828649 -0.4453458 -0.4258231 -0.152927 -0.1235193 0.1841114 -0.7680983 -0.1999579 0.0128178 -0.2770533 -0.4292129 -0.9682895 -0.1565243 -0.0524357 -0.3705939 -0.6541413 -0.0783963 -0.0947752 -0.0456684 -0.3330753 -0.0847326 -0.146683 -0.0033033 0.3770679 -0.2233039 0.0238259 -0.0856346 -0.0293985 -0.0385891 0.119626 0.2392468 -0.0169682 0.3965243 -0.5038382 -0.0753668 0.0421993 -0.0151538 -0.0271474 0.2974275 0.1212997 0.0148904 -0.2505927 -0.0864882 0.016277 0.0914632 0.004719 0.0796402 -0.8238268 -0.0336258 -0.0119814 -0.0024634 0.0884171 0.013902 -0.083907 0.0436184 0.0161137 0.0504926 -0.2404837 -0.0003425 0.0123634 0.1314765 -0.0340298 0.0040195 -0.0322026 -0.1525035 -0.1179784 0.2827111 0.036833 -0.0040752 -0.05727 -0.0153306 0.0134072 0.0287354 -0.1197166 0.0903535 -0.2484288 0.1068357 -0.0231354 1.0606163 -0.3527678 -0.0243297 -0.3432444 0.209517 0.8972493 -0.1333921 0.1770435 -0.5921043 0.9793357 0.3083996 -0.0754077 0.2565142 0.3611976 -0.2899235 -0.1564073 0.0097535 -0.1652511 -0.0066756 0.009741 0.0355378 0.0034645 -0.2199125 1.4841758 -0.0104676 0.041894 0.0063805 0.8669097 0.098489 0.12477 0.0450314 0.1897774 -0.138708 0.3778273 -0.1078204 -0.0003045 -0.1412829 0.0101583 -0.0274897 0.0407228 -0.2236097 -0.36301 0.0175135 -0.0368605 -0.017311 0.2032513 0.0371606 -0.0209324 0.0548518 -0.1028429 0.1669096 -0.0783977 0.0289167 0.0719228 0.2341687 -0.0575299 0.0253408 -0.0615191 -0.1036333 0.0815666 0.0725586 0.0562766 0.1724507 -0.3963981 -0.0379613 0.096332 -0.017452 -0.1147288 0.0482918 0.096521 -0.0112425 0.0371928 -0.0571122 0.0118111 -0.0249585 0.0075141 0.1508403 0.0747717 -0.0981159 -0.0079117 -0.0169889 0.0579403 -0.0028073 -0.0037642 -0.0083318 0.1544962 0.06136 0.0054741 -0.0057858 0.0818336 -0.0769911 0.0211778 -0.0275724 0.0149489 0.1687381 0.0194575 -0.0730281 0.0150481 -0.1167258 -0.0556485 0.0424809 0.0298256 0.0591627 0.1588809 0.0556424 0.0358697 -0.0190249 0.0911376 -0.0257158 -0.0165955 -0.0276452 -0.0335655 0.1395043 -0.1190301 0.0431212 -0.017158 0.0328739 0.0905552 0.0114141 -0.0159855 -0.0001735 0.1576235 -0.0685466 0.0521235 -0.0300463 0.0146122 0.0783095 -0.0116742 -0.0328548 0.0055657 0.1550439 0.0889971 -0.1007702 -0.0256231 -0.0156277 0.3497074 -0.010203 -0.0577949 -0.0839508 0.3689448 unknown
polarizability: 248.7237439|9.2551805|189.7145831|9.3666194|5.3137866|67.5581887 unknown
InChI: InChI=1S/C14H8O3/c15-10-6-7-12(17)14-9(10)5-4-8-2-1-3-11(16)13(8)14/h1-7,16H
charge 0 multiplicity 1
25 atoms
O  1.512581 2.299092 -0.629937
O  -0.435909 2.434769 1.160292
O  -3.60785 -1.618138 -0.345143
C  0.984031 0.020071 0.000128
C  -0.440919 0.255575 0.060715
C  1.468903 -1.347068 0.088418
C  -1.33048 -0.843054 -0.0536
C  0.5233 -2.427351 0.073351
C  -0.838645 -2.185375 -0.06031
C  1.972044 1.049939 -0.212892
C  -1.04591 1.574166 0.453589
C  2.873422 -1.614962 0.165471
C  -2.811233 -0.638294 -0.180698
C  3.343066 0.76706 -0.113904
C  -2.486967 1.794469 0.13506
C  3.792318 -0.56594 0.107105
C  -3.324213 0.753449 -0.144293
H  0.902015 -3.453608 0.139534
H  -1.569262 -2.996614 -0.13535
H  3.212322 -2.652172 0.256811
H  4.076688 1.571046 -0.254246
H  -2.844322 2.824855 0.242161
H  4.866719 -0.76303 0.181556
H  -4.39963 0.881594 -0.308487
H  2.227228 2.981617 -0.59363
