program: Gaussian 09
title: 000298872
version: EM64L-G09RevD.01
frameworkgroup: C1[X(C7H17NO)]
method: RPBEPBE
basis: SDD
operation: Freq
keyword: #p
keyword: freq=noraman
keyword: PBEPBE/SDD
title: #p freq=noraman PBEPBE/SDD
converged: YES YES NO NO
title: Mulliken charges:
elementType: O N C C C C C C C H H H H H H H H H H H H H H H H H
charge: -0.471344 -0.540713 0.307039 0.301235 -0.510818 -0.750079 -0.777641 -0.749414 -0.765405 0.213424 0.225547 0.214571 0.214108 0.224030 0.227655 0.211706 0.218896 0.204006 0.221670 0.239596 0.253685 0.213724 0.201071 0.332837 0.271802 0.268808
chargesum: 0.00000
title: Mulliken charges with hydrogens summed into heavy atoms:
elementType: O N C C C C C C C
charge: -0.138507 -0.000103 0.307039 0.301235 -0.071847 -0.097369 -0.119383 -0.084142 -0.096924
polarizability: 9.42290031e+01 -1.58836268e+00 8.23451138e+01 -9.08634764e-01 1.81704934e+00 8.32077966e+01
1716.lowfreq: -16.1754 0.0005 0.0007 0.0010 2.6130 14.5015 72.7077 115.4239 176.0606
frequency: 72.5924 115.4098 175.9895 195.7098 223.3379 247.2367 259.9197 278.2331 280.2124 310.6913 332.3739 341.1453 362.8558 373.6848 389.8739 397.5794 461.3711 475.2581 533.0577 639.1837 723.0296 785.2349 838.7509 882.8258 895.3887 925.3444 928.0390 942.2134 995.2599 1020.0123 1043.3725 1087.7821 1100.2104 1145.1136 1170.7633 1214.3324 1228.8570 1240.8329 1290.0147 1339.7125 1346.7756 1374.6502 1378.2158 1383.8691 1402.7024 1448.6437 1456.5659 1466.8047 1469.3831 1472.1652 1485.8856 1487.0090 1496.8770 1502.0431 1649.0881 2969.5546 2973.7020 2975.5420 2978.8733 2998.8051 3053.0682 3059.6967 3064.8226 3067.2399 3074.0313 3074.3074 3083.1886 3088.1514 3113.1205 3444.0345 3542.6371 3572.4551
redmass: 2.4312 2.2476 1.1081 2.9610 1.1124 1.1621 1.7318 1.1864 1.9380 1.9862 1.8870 2.1465 2.1575 1.8890 1.4008 2.2562 2.8558 2.7129 2.3836 1.7784 2.7293 2.8212 1.6911 1.7506 2.2221 1.6506 1.6415 1.2572 1.4754 1.3396 1.5410 1.5690 2.6055 2.3870 1.7504 2.5961 3.1134 2.8245 1.6244 1.3056 1.2882 1.1937 1.2095 1.3125 1.2010 1.0776 1.0527 1.0545 1.0520 1.0506 1.0500 1.0519 1.0518 1.0579 1.0854 1.0396 1.0360 1.0534 1.0421 1.0369 1.0980 1.0981 1.0992 1.0989 1.0984 1.0987 1.0999 1.0981 1.0978 1.0449 1.0650 1.0963
irintensity: 0.2005 1.8803 6.7023 3.6016 0.2000 1.3164 14.5458 19.9845 24.3176 3.4314 58.7933 7.4085 7.9555 18.1103 64.6336 13.9702 6.9094 1.6758 2.8208 188.9306 172.9027 7.0626 6.7800 23.5511 10.2552 2.6077 2.1032 0.3360 7.5967 0.4967 24.4402 4.4149 37.6861 13.5451 42.2859 13.3012 4.5931 2.9804 16.4810 3.0840 2.0596 26.4695 28.7299 37.7391 10.1656 1.4547 5.2897 2.4515 1.9669 0.1760 25.2177 9.9472 5.5114 15.2069 31.0744 22.7241 26.3914 44.0671 43.4782 17.6749 24.6567 21.1003 5.9830 28.2188 64.0755 66.9881 21.6047 38.1187 18.6508 1.1388 2.4817 3.2097
temp: 298.150 k
press: 1.00000 atm
elementType: 8 7 6 6 6 6 6 6 6 1 1 1 1 1 1 1 1 1 1 1 1 1 1 1 1 1
symmnumber: 1
zpe: 611391.7 jmol-1
zpe.correction: 0.232867 hartree
zpe.thermalcorrener: 0.244916 hartree
zpe.thermalcorrenthalpy: 0.245860 hartree
zpe.thermalcorrgfe: 0.197157 hartree
zpe.sumelectzpe: -406.127459 hartree
zpe.sumelectthermal: -406.115410 hartree
zpe.sumelectthermalent: -406.114466 hartree
zpe.sumelectthermalfe: -406.163169 hartree
dipole: 1.4046 -0.2097 0.6433
dipole: 1.5591
quadrupole: -61.4212 -61.8962 -56.3927
quadrupole: -4.6444 -1.2735 3.6020
quadrupole: -1.5178 -1.9928 3.5107 -4.6444 -1.2735 3.6020
hfenergy: -406.3603262 hartree
pointgroup: C01 [X(C7H17N1O1)]
dipole: 0.5570242 -0.0932309 0.2393172 debye
dipolederiv: -0.6936414 -0.0385265 -0.0869979 -0.0764298 -0.2577806 0.1596239 -0.0873349 0.1484874 -0.7431817 -0.9286361 -0.2208724 0.0225663 -0.3570473 -0.5368391 0.0580686 -0.0241725 0.0377908 -0.2084497 0.0691284 0.0171312 -0.0348251 -0.0365931 0.0739587 0.0180585 0.0372527 -0.0123335 0.0671268 0.3189244 -0.045207 0.0357642 -0.0566062 0.203021 -0.0165401 0.0642623 -0.0031928 0.525993 0.5031492 0.0068112 -0.0002554 -0.037571 0.2242697 0.0376518 -0.0272543 -0.0230868 0.1076906 0.0137108 0.0247495 -0.0399976 0.0160923 0.0283355 0.0447286 -0.0154581 0.0430211 -0.062863 -0.0521132 0.0587717 0.0334559 0.0552717 -0.0358355 -0.080899 0.0069037 -0.0629892 -0.0090581 -0.0495353 -0.0782931 0.0106846 -0.0332082 -0.0361453 0.0395968 -0.0016307 0.0303614 0.0190099 -0.048993 0.0248823 0.0325715 0.0212691 -0.1397159 -0.0979681 0.0315017 -0.0320257 0.008829 -0.0010925 0.0545377 0.0268217 0.0800915 -0.1292988 -0.0876177 0.0630556 -0.1101754 0.0076525 0.0457693 0.0061622 -0.0196363 0.0037974 0.0658537 0.0323592 -0.0458425 0.0636713 -0.1405231 0.0888567 0.0333173 0.0677543 0.0334855 -0.0223678 -0.1354348 0.0498665 -0.0978155 -0.0661588 -0.1879535 0.065404 -0.0595456 0.041633 0.0782434 0.0140773 0.0069471 0.0026228 0.0729385 0.0418222 -0.1225627 0.0396264 -0.1055655 -0.105103 0.0616313 0.0203557 0.0293285 0.0516853 -0.1507719 0.1065201 -0.0005551 0.0605915 0.0585812 -0.0040154 -0.0547076 0.0161485 0.0880668 0.0980376 0.0010138 -0.0488693 -0.0051526 0.046814 0.1003847 -0.0170967 0.0473557 -0.1603057 0.013203 -0.1561565 -0.0094638 -0.1397043 -0.0750565 -0.0051458 0.013762 0.0159755 0.0660518 -0.1888607 0.0439314 0.0364232 0.1132652 0.0460574 -0.0119674 0.0329412 -0.0029149 0.085423 0.0980006 0.0015785 0.0187644 -0.0203364 -0.0488864 -0.1067591 -0.0070373 -0.139731 -0.0600126 0.1096518 0.0378815 -0.0553858 0.0051621 0.0229597 0.076467 -0.023794 0.1060495 -0.0684223 0.0548708 -0.1203047 0.0355029 -0.098491 -0.042605 0.0409438 0.0360264 0.0650196 0.0565277 -0.1471819 0.1291059 0.0262152 0.061521 0.1015984 -0.0069995 -0.0020187 0.0025206 0.0819615 0.0815161 -0.0147008 -0.0756949 -0.0001059 0.0838728 0.0450126 -0.0654069 0.0062699 -0.1315463 0.3829363 0.0335593 0.0423161 0.0560632 0.0328534 -0.1390331 0.0357307 -0.103173 0.2228527 0.283378 0.0693125 0.044636 0.1973086 0.219662 0.108919 -0.0044629 0.0694677 0.0873184 0.2458243 0.081954 -0.041876 0.2212595 0.1435532 -0.1451433 -0.0223885 -0.0966523 0.1013937 unknown
polarizability: 94.1058104|-1.7923814|82.4300763|-1.1420117|1.8847969|83.2460267 unknown
InChI: InChI=1S/C7H17NO/c1-6(2,3)7(4,9)5-8/h9H,5,8H2,1-4H3
charge 0 multiplicity 1
26 atoms
O  -0.743124 0.651987 -1.457834
N  -2.829024 -0.528582 0.176175
C  1.11361 -0.179439 0.031942
C  -0.402085 0.286828 -0.046418
C  -1.406148 -0.839204 0.396663
C  1.443799 -0.747183 1.441865
C  1.417201 -1.284947 -1.023718
C  2.059919 1.017782 -0.261592
C  -0.678586 1.588085 0.725956
H  -1.165821 -1.769786 -0.155268
H  -1.266353 -1.06242 1.469383
H  1.173062 -0.037591 2.244887
H  2.530702 -0.93704 1.520035
H  0.926278 -1.703636 1.638667
H  2.446522 -1.660198 -0.876085
H  1.370051 -0.890284 -2.056989
H  0.739496 -2.154531 -0.943902
H  3.098481 0.657526 -0.388156
H  2.060104 1.751008 0.56441
H  1.756422 1.537858 -1.188042
H  -0.13281 2.431993 0.276289
H  -1.75555 1.826131 0.675795
H  -0.387983 1.499479 1.787638
H  -0.582823 -0.141001 -2.032078
H  -2.994768 -0.126147 -0.754106
H  -3.250174 0.047312 0.911487
