program: Gaussian 09
title: 000298879
version: EM64L-G09RevD.01
frameworkgroup: C1[X(C13H16O3)]
method: RPBEPBE
basis: SDD
operation: Freq
keyword: #pfreq=noraman
keyword: PBEPBE/SDD
title: #p freq=noraman PBEPBE/SDD
converged: YES YES NO NO
title: Mulliken charges:
elementType: O O O C C C C C C C C C C C C C H H H H H H H H H H H H H H H H
charge: -0.424467 -0.231257 -0.218827 0.220987 -0.404356 -0.551414 -0.730357 -0.717204 0.123557 0.127194 0.276139 -0.342731 -0.345304 -0.249426 -0.230791 -0.223659 0.242185 0.229614 0.249479 0.248751 0.226074 0.230525 0.211374 0.215346 0.217220 0.246323 0.376795 0.251277 0.277509 0.231903 0.233652 0.233885
chargesum: 0.00000
title: Mulliken charges with hydrogens summed into heavy atoms:
elementType: O O O C C C C C C C C C C C C C
charge: -0.047672 -0.231257 -0.218827 0.220987 0.067443 -0.053183 -0.062384 -0.038314 0.123557 0.127194 0.276139 -0.091454 -0.067794 -0.017523 0.002861 0.010226
polarizability: 1.88034127e+02 -1.20094419e+01 1.50410034e+02 3.10035309e+00 9.41685454e+00 9.91151417e+01
1716.lowfreq: -11.5324 -0.0007 -0.0006 0.0007 4.3350 8.2980 18.9503 29.1083 36.0306
frequency: 17.5613 28.9942 35.9500 56.4986 77.8679 99.8555 157.9572 166.3117 193.3679 200.6902 241.8292 247.5481 267.9594 302.4694 343.3696 376.8441 401.0353 416.8661 418.5896 476.9037 494.0754 543.3244 568.7671 601.6510 613.9059 641.0658 693.9576 697.5127 727.4515 751.7673 783.7944 794.6435 860.0310 884.4643 926.1832 943.4444 947.6516 978.1709 989.7348 992.3566 994.5292 1010.0285 1018.8477 1027.3976 1039.1690 1081.3248 1090.6186 1134.3362 1163.9381 1173.3349 1187.9965 1196.6351 1217.4033 1235.7759 1271.6757 1302.5684 1315.1506 1317.2400 1354.7449 1381.7634 1387.8301 1401.7465 1429.7520 1436.8366 1453.3382 1464.7778 1470.6177 1476.1642 1479.6340 1491.1943 1570.4460 1599.1348 1612.9414 1645.0289 2970.8737 2985.9294 2992.6995 3011.5388 3019.7990 3076.8113 3078.5013 3088.9562 3096.6420 3104.9383 3128.6692 3138.8672 3150.0598 3159.1711 3169.3664 3513.9194
redmass: 5.1282 7.4359 5.1957 5.5778 3.8876 2.5376 3.6418 3.0521 2.9283 1.0936 1.2581 3.7373 2.5357 4.7656 2.9325 3.1340 2.8144 3.2498 3.7087 5.3276 3.5076 3.8096 2.2342 1.2457 6.3521 5.4384 3.8519 1.8655 3.9686 1.6323 4.2872 1.7293 1.2501 2.4247 2.0606 1.4349 1.4869 2.5272 5.5551 1.3817 2.1549 1.3656 1.7672 2.0309 2.2260 1.8759 2.2067 1.3471 2.3411 1.0824 1.1277 2.3364 2.1508 2.0460 1.6555 1.8041 1.6000 1.3457 1.5945 1.2106 9.3322 1.2130 1.1380 2.1406 1.0783 1.0589 1.0523 1.0508 2.1958 1.0675 6.8214 6.7832 6.5400 8.5014 1.0601 1.0354 1.0363 1.0612 1.0961 1.1023 1.1001 1.0997 1.0993 1.0997 1.0851 1.0880 1.0923 1.0960 1.1013 1.0640
irintensity: 2.2103 0.7572 0.5291 1.2992 2.1108 1.1510 0.2014 0.1075 4.3651 0.2458 0.2139 1.9448 0.0886 5.5638 6.8584 0.5804 0.1090 1.9506 0.1488 6.4306 14.7433 17.7135 5.3370 142.8119 1.0722 3.2032 5.0066 51.8473 29.8223 69.6732 6.4486 3.8922 0.6156 4.1249 25.6667 1.5200 4.6195 26.8909 3.4999 0.2342 37.3748 8.9820 35.0557 2.2656 183.6996 9.5905 3.4774 1.8212 9.4073 2.0983 23.6014 4.2386 73.0056 19.9914 48.8251 81.7382 7.7543 14.4799 39.1882 15.5922 2.7754 25.7075 7.6385 24.7374 3.1846 3.8915 6.0996 14.5266 1.0696 22.2425 90.8734 41.9315 10.2823 202.8970 22.2719 25.7527 20.8727 11.9063 7.3143 14.3882 16.4341 43.1227 30.0659 24.1528 0.1613 6.0882 16.2670 22.6159 20.1144 22.0936
temp: 298.150 k
press: 1.00000 atm
elementType: 8 8 8 6 6 6 6 6 6 6 6 6 6 6 6 6 1 1 1 1 1 1 1 1 1 1 1 1 1 1 1 1
symmnumber: 1
zpe: 682368.4 jmol-1
zpe.correction: 0.259900 hartree
zpe.thermalcorrener: 0.276294 hartree
zpe.thermalcorrenthalpy: 0.277239 hartree
zpe.thermalcorrgfe: 0.213679 hartree
zpe.sumelectzpe: -729.472023 hartree
zpe.sumelectthermal: -729.455629 hartree
zpe.sumelectthermalent: -729.454684 hartree
zpe.sumelectthermalfe: -729.518244 hartree
dipole: -0.9690 1.4870 0.0390
dipole: 1.7753
quadrupole: -80.4638 -102.4150 -93.5203
quadrupole: -7.9715 -1.4999 -4.4200
quadrupole: 11.6692 -10.2819 -1.3873 -7.9715 -1.4999 -4.4200
hfenergy: -729.7319229 hartree
pointgroup: C01 [X(C13H16O3)]
dipole: -0.3746892 -0.5754454 -0.1277959 debye
polarizability: 187.6945117|13.0499127|145.1199279|-1.4277626|18.488749|104.7448633 unknown
InChI: InChI=1S/C13H16O3/c1-13(2,12(15)16)9-8-11(14)10-6-4-3-5-7-10/h3-7,15H,8-9H2,1-2H3
charge 0 multiplicity 1
32 atoms
O  3.260467 -0.988652 1.711798
O  3.123363 -2.139084 -0.289947
O  -0.778423 2.11635 0.782048
C  3.056725 0.359154 -0.308632
C  1.724104 1.025517 0.176888
C  0.45021 0.21787 -0.130814
C  3.101963 0.231513 -1.850274
C  4.24985 1.226866 0.18614
C  3.154288 -1.04055 0.310146
C  -0.828293 0.947116 0.297003
C  -2.149565 0.248471 0.120898
C  -2.256572 -1.058567 -0.427696
C  -3.332297 0.930093 0.518919
C  -3.520389 -1.66957 -0.573863
C  -4.593183 0.319806 0.373382
C  -4.690629 -0.983037 -0.173911
H  1.7845 1.202254 1.265415
H  1.650444 2.021543 -0.297978
H  0.480066 -0.76882 0.374798
H  0.372201 -0.004351 -1.214211
H  4.07565 -0.169377 -2.182235
H  2.325208 -0.450842 -2.233887
H  2.96015 1.226954 -2.308741
H  4.172701 2.238585 -0.252324
H  5.216516 0.79182 -0.126486
H  4.247546 1.317521 1.284763
H  3.310365 -1.918055 2.065279
H  -1.36027 -1.603286 -0.742123
H  -3.229049 1.936353 0.938712
H  -3.594404 -2.677057 -0.997476
H  -5.498854 0.852465 0.683367
H  -5.671089 -1.459103 -0.287458
