program: Gaussian 09
title: 000298310
version: EM64L-G09RevD.01
frameworkgroup: C1[X(C13H16O7)]
method: RPBEPBE
basis: SDD
operation: Freq
keyword: #pfreq=noraman
keyword: PBEPBE/SDD
title: #p freq=noraman PBEPBE/SDD
converged: YES YES NO NO
title: Mulliken charges:
elementType: O O O O O O O C C C C C C C C C C C C C H H H H H H H H H H H H H H H H
charge: -0.540856 -0.465009 -0.429009 -0.179118 -0.371031 -0.458540 -0.240019 0.140309 -0.596494 -0.224673 0.128082 -0.049590 0.467208 0.138608 -0.376551 -0.377627 -0.425826 -0.227548 -0.227555 -0.236021 0.268434 0.274069 0.244005 0.239013 0.179620 0.246266 0.401247 0.258837 0.245938 0.372108 0.351171 0.230426 0.227968 0.231878 0.400490 0.379791
chargesum: 0.00000
title: Mulliken charges with hydrogens summed into heavy atoms:
elementType: O O O O O O O C C C C C C C C C C C C C
charge: -0.139609 -0.092901 -0.077838 -0.179118 0.029459 -0.078748 -0.240019 0.140309 -0.078420 0.043761 0.128082 0.189422 0.467208 0.138608 0.049335 -0.118790 -0.179888 0.002878 0.000414 -0.004143
polarizability: 2.07666917e+02 -5.14624970e+00 1.56413328e+02 9.29960417e+00 1.88502003e+01 1.22429390e+02
1716.lowfreq: -0.0007 -0.0006 -0.0004 2.5816 6.0899 8.8473 25.9044 30.8758 43.3064
frequency: 25.5626 30.7182 43.2762 57.7859 73.3757 82.3054 87.3946 134.6180 150.9352 164.4509 181.6299 191.3504 202.7729 230.5268 249.5484 272.1449 313.5776 329.2228 349.5817 381.2365 403.7350 410.9067 428.6691 447.9020 460.9306 476.3492 509.0716 518.5297 531.2291 558.7508 568.9525 595.4386 617.6732 646.1351 664.8288 681.3009 706.3004 721.3283 766.4729 775.2132 809.9054 832.6442 859.3721 877.3461 904.9177 931.6084 970.5758 981.3564 984.1040 990.7859 991.8389 998.9900 1016.2540 1028.2135 1030.8960 1042.8576 1053.3511 1076.4631 1095.2146 1111.5436 1169.7543 1174.1645 1190.5874 1214.9230 1223.2449 1233.4411 1236.5124 1241.8653 1296.6553 1303.6687 1321.9381 1332.3250 1341.5198 1365.6272 1377.8508 1383.0189 1393.0920 1441.5185 1442.4914 1458.4134 1476.8568 1484.4493 1591.9765 1595.3136 1614.0295 1619.8781 2955.0848 2981.0362 3016.1699 3070.4405 3082.4604 3084.9665 3122.5468 3129.6819 3141.2468 3150.8735 3166.3486 3367.6125 3395.1969 3444.1157 3514.3327 3526.4558
redmass: 6.3025 6.1417 4.8732 7.6250 5.8814 6.1109 7.8436 7.9328 6.4000 5.0857 6.7030 4.3166 3.3706 5.9068 4.1356 3.9952 4.4278 2.8649 1.6333 2.8549 3.0608 3.5268 5.3415 3.9312 3.6192 1.2875 3.5110 3.2055 2.3677 1.8636 2.4010 2.4816 6.1429 2.1532 2.7084 1.4591 2.2958 2.6281 2.4577 3.7592 4.8752 3.1628 1.2425 2.7548 2.6291 1.7057 4.0715 1.3995 3.5874 6.0238 3.3257 1.3574 3.9063 2.2214 1.9520 3.1832 3.1992 2.1998 2.1287 2.9559 1.1310 1.0542 1.1226 2.1555 1.3968 1.3067 1.2146 1.2576 1.3662 1.7128 1.1687 1.2625 1.2940 1.7074 1.4920 7.2617 1.4994 1.6591 1.3460 1.1399 1.0868 2.2801 6.5242 8.5684 6.1253 8.8844 1.0698 1.0826 1.0605 1.0850 1.0943 1.1015 1.0858 1.0871 1.0923 1.0963 1.1016 1.0663 1.0640 1.0648 1.0644 1.0647
irintensity: 0.2258 0.8941 0.4300 0.6552 1.2222 0.8526 5.3079 4.3061 1.0951 4.5780 2.1242 1.3262 2.1707 16.6359 32.2168 29.9660 24.7623 26.9438 139.5040 30.9753 14.1443 10.9582 13.7203 4.7895 21.4775 65.7427 5.1687 25.3234 22.2960 13.6289 62.9728 79.0401 2.1206 18.1523 98.1468 210.3740 24.4605 21.1502 33.1906 19.8159 3.8183 0.7200 0.6591 9.5375 32.7690 15.5971 56.4676 1.7247 89.9661 11.6364 36.7542 1.0823 19.1474 5.9924 17.5664 258.5344 20.2474 80.2383 38.2931 60.1501 47.3457 0.0361 0.6411 6.7834 26.6426 85.7197 26.6624 43.4202 17.8498 56.9059 18.8973 0.0072 3.8381 54.7083 8.7246 0.4381 25.6571 17.3148 98.3158 14.7336 7.6337 15.5338 23.0729 51.5968 5.7197 161.3050 37.3682 62.2735 7.0373 5.8786 46.0473 0.6166 3.6511 0.0489 16.9278 30.3156 19.0377 302.9717 58.0216 31.2893 52.3335 12.4503
temp: 298.150 k
press: 1.00000 atm
elementType: 8 8 8 8 8 8 8 6 6 6 6 6 6 6 6 6 6 6 6 6 1 1 1 1 1 1 1 1 1 1 1 1 1 1 1 1
symmnumber: 1
zpe: 725557.0 jmol-1
zpe.correction: 0.276350 hartree
zpe.thermalcorrener: 0.296338 hartree
zpe.thermalcorrenthalpy: 0.297282 hartree
zpe.thermalcorrgfe: 0.226871 hartree
zpe.sumelectzpe: -1030.002015 hartree
zpe.sumelectthermal: -1029.982027 hartree
zpe.sumelectthermalent: -1029.981083 hartree
zpe.sumelectthermalfe: -1030.051494 hartree
dipole: 3.8689 -3.2657 0.0947
dipole: 5.0638
quadrupole: -113.4981 -115.2756 -125.7012
quadrupole: 1.4396 1.5241 -0.2575
quadrupole: 4.6602 2.8827 -7.5429 1.4396 1.5241 -0.2575
hfenergy: -1030.278365 hartree
pointgroup: C01 [X(C13H16O7)]
dipole: -1.6306325 -1.1432411 -0.055159 debye
polarizability: 207.5436324|1.452509|154.5243807|10.4756117|-20.6720703|124.4416215 unknown
InChI: InChI=1S/C13H16O7/c14-7-9(15)10(16)11(17)13(20,12(18)19)6-8-4-2-1-3-5-8/h1-5,9-10,14-16,18,20H,6-7H2
charge 0 multiplicity 1
36 atoms
O  0.460486 0.381541 -1.399944
O  3.888935 -1.808327 -0.277512
O  3.944556 0.294385 1.53254
O  1.611341 -1.975334 1.130006
O  -0.945815 -2.73967 -0.138498
O  2.392208 2.276841 -1.197409
O  -0.854499 -1.727773 -2.227506
C  0.23151 -0.598394 -0.343583
C  -0.581126 0.020689 0.847207
C  2.909743 -0.727394 -0.477239
C  1.594376 -1.149001 0.179743
C  3.589687 0.557425 0.144265
C  -1.989823 0.444567 0.466178
C  -0.569873 -1.745789 -1.004939
C  2.786783 1.869977 0.14248
C  -2.215042 1.635406 -0.272765
C  -3.105145 -0.34497 0.848587
C  -3.526154 2.022552 -0.628153
C  -4.417695 0.043253 0.496794
C  -4.631596 1.226988 -0.246121
H  2.769561 -0.565287 -1.55828
H  -0.589816 -0.737037 1.649469
H  0.003071 0.886965 1.206937
H  4.497615 0.693865 -0.480755
H  1.923541 1.783558 0.837536
H  3.444782 2.664458 0.529855
H  -0.012932 0.066151 -2.223364
H  -1.361268 2.257896 -0.562555
H  -2.942396 -1.258594 1.433004
H  3.504052 -2.436344 0.396596
H  4.514854 -0.518878 1.536875
H  -3.686065 2.945763 -1.196144
H  -5.270431 -0.571267 0.806628
H  -5.648691 1.530714 -0.517672
H  -1.463083 -3.442266 -0.618895
H  1.618346 1.698929 -1.460265
