program: Gaussian 09
title: 000298854
version: EM64L-G09RevD.01
frameworkgroup: C1[X(C13H18O3)]
method: RPBEPBE
basis: SDD
operation: Freq
keyword: #pfreq=noraman
keyword: PBEPBE/SDD
title: #p freq=noraman PBEPBE/SDD
converged: YES YES NO NO
title: Mulliken charges:
elementType: O O O C C C C C C C C C C C C C H H H H H H H H H H H H H H H H H H
charge: -0.490317 -0.254751 -0.279870 0.117534 -0.229898 0.407226 -0.734021 -0.704453 0.245465 -0.388103 -0.401707 -0.257425 -0.222934 -0.242516 -0.262095 -0.661506 0.246379 0.221850 0.251353 0.209411 0.249841 0.219657 0.239262 0.368482 0.221845 0.295926 0.222990 0.224218 0.226027 0.227070 0.238094 0.220868 0.246821 0.229280
chargesum: 0.00000
title: Mulliken charges with hydrogens summed into heavy atoms:
elementType: O O O C C C C C C C C C C C C C
charge: -0.121836 -0.254751 -0.279870 0.117534 0.016481 0.407226 -0.051408 0.004307 0.245465 -0.166258 -0.105780 -0.034435 0.001284 -0.016489 0.203069 0.035463
polarizability: 2.00444630e+02 2.13270023e+00 1.38215612e+02 9.43511507e+00 -1.27813393e+00 1.03811516e+02
1716.lowfreq: -13.1711 -5.6369 -0.0008 -0.0007 -0.0003 4.2071 25.9382 36.6884 47.2054
frequency: 25.7016 36.4449 47.1579 73.0096 81.1653 97.1131 172.3385 195.0886 202.9534 205.0273 228.3989 240.9395 252.3019 253.8578 297.4941 325.0552 338.4428 360.3784 404.0631 433.1851 456.0809 483.0356 555.9725 583.9838 605.2752 617.2306 677.2494 701.8112 707.0648 730.2528 768.2207 783.6928 817.7683 826.1280 856.5773 879.5897 900.7610 927.7100 979.1767 989.9315 996.9803 1002.6526 1005.0134 1020.9415 1031.3367 1062.9801 1074.3738 1085.9778 1095.9049 1112.0757 1137.4049 1157.6624 1161.0395 1170.4037 1184.3027 1199.7314 1276.4718 1278.5699 1309.1446 1316.2474 1355.2462 1375.8016 1380.4156 1381.3336 1391.0481 1391.4535 1434.5744 1456.5355 1462.0167 1464.0726 1468.2835 1473.4742 1478.0125 1483.8244 1485.8050 1590.7709 1598.2471 1613.1313 2984.7634 2994.3326 2995.5471 3033.6211 3041.6481 3078.2317 3089.8518 3094.6198 3095.4639 3100.0472 3107.0168 3111.0230 3122.2809 3125.1417 3138.6873 3157.5079 3181.2446 3405.8398
redmass: 3.6928 3.1617 3.8155 3.4371 5.2090 3.9358 2.3185 1.1938 2.0463 3.4873 1.4375 1.4351 4.3840 1.9810 3.2737 4.3488 3.8438 3.9055 2.8506 3.4241 4.4635 3.2924 4.1326 1.4247 1.9717 6.1973 4.5555 4.2017 1.7201 4.7783 1.9168 1.8616 1.9199 2.3186 1.2550 2.3888 2.3187 1.4308 1.3619 6.2269 1.4847 1.3264 2.5503 2.8833 2.9480 1.7028 1.8616 1.5683 2.2217 3.3833 2.9687 1.7129 2.2827 1.0607 1.2018 1.9518 1.1487 1.3151 1.4905 1.4944 1.3505 2.1750 1.7215 1.2268 1.6368 1.2706 2.1909 1.1025 1.0953 1.0458 1.0582 1.2092 1.0541 1.0522 1.7451 6.2203 6.8411 6.1140 1.0356 1.0360 1.0345 1.0593 1.0840 1.0993 1.0974 1.1005 1.1030 1.0992 1.1004 1.0871 1.1068 1.0870 1.0934 1.0992 1.0947 1.0657
irintensity: 0.2949 0.4614 0.4601 0.8406 0.3974 0.3783 2.3791 0.1978 3.9742 2.1143 0.2958 1.0136 2.1650 0.2828 3.3255 3.3360 25.2038 8.4970 0.0360 6.3484 6.3777 10.0959 12.5863 65.8584 101.9083 1.4588 1.6128 11.8173 58.6681 6.2361 38.2393 8.4320 6.3747 5.0679 0.4791 14.4338 6.7749 5.4142 0.4395 0.2740 5.7598 3.3333 21.2993 50.4090 10.5551 47.0297 83.0294 0.3407 60.1997 108.8085 165.9431 41.2266 43.5320 1.9931 12.9077 32.1807 8.5231 4.6833 43.7890 41.9538 7.4256 56.4085 33.1822 0.7293 25.7506 33.5109 22.5494 12.9893 0.8328 14.3416 11.8604 13.2353 15.6602 14.6963 27.6958 4.4383 101.4860 5.4804 19.8208 19.1994 20.7466 29.3808 5.6248 37.4480 37.0482 17.3463 1.8517 17.5078 13.2807 13.8365 29.9505 2.3395 37.1026 29.9016 7.1288 127.3589
temp: 298.150 k
press: 1.00000 atm
elementType: 8 8 8 6 6 6 6 6 6 6 6 6 6 6 6 6 1 1 1 1 1 1 1 1 1 1 1 1 1 1 1 1 1 1
symmnumber: 1
zpe: 741312.4 jmol-1
zpe.correction: 0.282351 hartree
zpe.thermalcorrener: 0.299259 hartree
zpe.thermalcorrenthalpy: 0.300203 hartree
zpe.thermalcorrgfe: 0.236988 hartree
zpe.sumelectzpe: -730.639562 hartree
zpe.sumelectthermal: -730.622655 hartree
zpe.sumelectthermalent: -730.621710 hartree
zpe.sumelectthermalfe: -730.684926 hartree
dipole: -2.4010 -2.5588 0.6757
dipole: 3.5733
quadrupole: -79.1754 -97.5008 -97.5726
quadrupole: 2.2079 1.2941 2.0943
quadrupole: 12.2409 -6.0845 -6.1564 2.2079 1.2941 2.0943
hfenergy: -730.9219132 hartree
pointgroup: C01 [X(C13H18O3)]
dipole: 0.9390453 -0.9531466 -0.4314607 debye
polarizability: 200.3345752|-4.1949855|136.8337272|9.2582447|6.9277751|105.3034551 unknown
InChI: InChI=1S/C13H18O3/c1-4-16-12(14)10(2)13(3,15)11-8-6-5-7-9-11/h5-10,15H,4H2,1-3H3
charge 0 multiplicity 1
34 atoms
O  -0.122968 1.701673 0.907952
O  3.047265 -0.691577 -0.828875
O  2.580951 1.284679 0.307435
C  -0.192869 0.263814 0.60341
C  0.726876 -0.054428 -0.64263
C  -1.657059 -0.056442 0.266023
C  0.258999 -0.543344 1.849568
C  0.308166 0.752009 -1.90303
C  2.181298 0.263905 -0.321506
C  -2.047186 -1.38279 -0.053731
C  -2.639829 0.962136 0.277826
C  -3.392583 -1.684356 -0.358828
C  -3.987714 0.660105 -0.023396
C  -4.370497 -0.662185 -0.344214
C  4.516652 -0.464921 -0.613474
C  4.957788 -1.052696 0.728698
H  0.662916 -1.133121 -0.87021
H  1.302149 -0.299175 2.121785
H  -0.389876 -0.278909 2.701056
H  0.186498 -1.633139 1.682255
H  -0.710744 0.46092 -2.208262
H  0.996217 0.552928 -2.743516
H  0.306815 1.833298 -1.683996
H  0.847082 1.93901 0.956572
H  -1.30492 -2.191123 -0.063748
H  -2.327212 1.979096 0.527509
H  -3.677748 -2.713758 -0.604441
H  -4.738583 1.458553 -0.007375
H  -5.415469 -0.895259 -0.578347
H  4.981957 -0.980833 -1.468144
H  4.713341 0.620003 -0.664528
H  6.053739 -0.9515 0.83545
H  4.480999 -0.517539 1.566872
H  4.702749 -2.124337 0.794338
