program: Gaussian 09
title: 000298865
version: EM64L-G09RevD.01
frameworkgroup: C1[X(C11H20O3)]
method: RPBEPBE
basis: SDD
operation: Freq
keyword: #pfreq=noraman
keyword: PBEPBE/SDD
title: #p freq=noraman PBEPBE/SDD
converged: YES YES NO NO
title: Mulliken charges:
elementType: O O O C C C C C C C C C C C H H H H H H H H H H H H H H H H H H H H
charge: -0.487484 -0.254141 -0.279994 0.350993 -0.490587 -0.489435 -0.231875 -0.387886 -0.407878 -0.389789 -0.734161 0.232523 -0.263151 -0.662215 0.216787 0.192005 0.192300 0.226856 0.242468 0.215269 0.188332 0.188528 0.228930 0.182129 0.203471 0.234871 0.220956 0.248247 0.354572 0.225854 0.236881 0.219609 0.248361 0.228656
chargesum: 0.00000
title: Mulliken charges with hydrogens summed into heavy atoms:
elementType: O O O C C C C C C C C C C C
charge: -0.132912 -0.254141 -0.279994 0.350993 -0.081795 -0.070280 0.010593 0.015716 0.009579 -0.004190 -0.030088 0.232523 0.199584 0.034411
polarizability: 1.50877813e+02 -3.90160839e+00 1.20283343e+02 -1.72369596e+00 -1.45037951e+00 1.06873820e+02
1716.lowfreq: -0.0008 -0.0005 -0.0004 6.2826 9.4201 13.9545 26.3816 48.8682 87.8618
frequency: 26.2877 48.7455 87.8539 93.3720 114.0914 145.2692 186.4272 198.3221 210.3313 236.4442 257.6692 262.2449 303.6957 306.8224 333.2907 349.8945 401.8362 415.7477 442.1749 481.7357 493.7160 580.9043 626.7708 674.4640 703.6102 730.9610 775.0534 782.1407 819.5249 832.2598 839.5993 864.3419 912.2999 922.6893 929.9866 933.3874 1001.2737 1009.1311 1039.4578 1048.2288 1062.9156 1084.2551 1092.6282 1096.3615 1100.7593 1125.9446 1143.6636 1157.8096 1163.5575 1197.3628 1250.5691 1261.8401 1269.9042 1277.5983 1293.7246 1309.1620 1324.1393 1338.0929 1343.3271 1345.8845 1353.8381 1356.7003 1380.8913 1392.7238 1398.4638 1446.8892 1455.9273 1456.6527 1456.9819 1464.0975 1467.5913 1472.9223 1476.3639 1483.7289 1484.8941 1598.2341 2957.5281 2959.0947 2971.7912 2985.8668 2988.8269 2994.1393 2994.9262 3019.8615 3026.9835 3030.1651 3033.0497 3045.3755 3049.5670 3059.4240 3089.2913 3090.4163 3095.6968 3106.0518 3122.0918 3408.4611
redmass: 3.8833 2.7154 3.0854 4.8906 2.8882 3.4955 1.8719 1.3692 2.2700 1.5661 2.0096 3.3354 2.3346 4.2232 3.6095 2.7507 2.1936 2.7795 3.4183 3.0458 1.9908 1.2655 2.0274 3.3791 4.1617 4.3967 1.5438 1.8235 1.7834 2.7069 1.9323 2.2995 2.6067 1.6344 2.0086 1.9927 2.1610 2.2636 2.2413 1.8769 1.8087 1.7920 1.7518 1.8930 1.7272 2.6125 1.7932 1.7060 2.5274 1.5622 1.3914 1.2636 1.2170 1.1207 1.4616 1.5158 1.3859 1.4124 1.3841 1.4432 1.4667 1.3539 1.2108 1.2314 1.5701 1.0881 1.1032 1.0939 1.0933 1.0437 1.0830 1.0754 1.0744 1.0493 1.0512 6.9580 1.0635 1.0602 1.0632 1.0629 1.0626 1.0361 1.0347 1.0981 1.0953 1.0841 1.0600 1.1002 1.1001 1.1012 1.0973 1.0997 1.1030 1.1009 1.1066 1.0655
irintensity: 0.4914 0.6836 0.3997 0.4518 1.1397 0.9713 2.0681 0.2953 3.3732 0.9830 1.4233 4.5068 1.3627 6.2863 16.8753 6.0233 1.1685 4.6237 9.8306 7.2438 1.0796 109.5373 55.0377 8.9272 5.7782 6.8435 1.2686 3.5807 5.8001 6.0387 9.3824 2.0673 5.8677 10.2806 25.3086 4.1390 18.2319 26.9187 45.0400 6.9433 10.6339 20.5877 18.1310 63.4546 1.8007 252.1133 10.6587 25.9273 51.9912 9.8626 11.9138 5.9640 5.8414 4.2110 12.9475 54.6304 13.0711 0.5158 5.4919 0.8633 11.6534 4.8064 24.3344 22.1116 61.1413 6.9645 3.8542 8.4042 12.9744 15.6136 13.8060 14.1068 2.4315 19.1475 17.2378 107.4306 41.1672 25.1268 38.4572 32.1554 50.1341 20.2638 21.4021 47.2165 67.5289 8.9007 29.3340 29.7196 20.1306 74.7887 36.7918 25.1291 1.3807 14.5873 31.6205 92.2588
temp: 298.150 k
press: 1.00000 atm
elementType: 8 8 8 6 6 6 6 6 6 6 6 6 6 6 1 1 1 1 1 1 1 1 1 1 1 1 1 1 1 1 1 1 1 1
symmnumber: 1
zpe: 776598.1 jmol-1
zpe.correction: 0.295791 hartree
zpe.thermalcorrener: 0.311130 hartree
zpe.thermalcorrenthalpy: 0.312074 hartree
zpe.thermalcorrgfe: 0.253310 hartree
zpe.sumelectzpe: -655.717295 hartree
zpe.sumelectthermal: -655.701956 hartree
zpe.sumelectthermalent: -655.701011 hartree
zpe.sumelectthermalfe: -655.759775 hartree
dipole: 2.3146 -0.6451 -2.3476
dipole: 3.3593
quadrupole: -76.9192 -84.0963 -91.1536
quadrupole: -1.6322 1.6366 -1.6532
quadrupole: 7.1371 -0.0399 -7.0972 -1.6322 1.6366 -1.6532
hfenergy: -656.0130854 hartree
pointgroup: C01 [X(C11H20O3)]
dipole: 0.9699276 0.2471519 0.8630987 debye
polarizability: 151.1406044|2.8082253|119.9716378|-0.9508088|-2.0096596|106.9227332 unknown
InChI: InChI=1S/C11H20O3/c1-3-14-10(12)9(2)11(13)7-5-4-6-8-11/h9,13H,3-8H2,1-2H3
charge 0 multiplicity 1
34 atoms
O  -1.218321 -0.556868 -1.380498
O  2.598016 -0.307057 0.667098
O  1.577568 -0.260479 -1.422315
C  -1.00754 -0.277055 0.053899
C  -0.871945 1.256561 0.291922
C  -2.26697 -0.818511 0.771276
C  0.29007 -1.015925 0.556735
C  -2.149529 2.025907 -0.111558
C  -3.542754 -0.037364 0.377682
C  -3.387466 1.47888 0.634741
C  0.230419 -2.556679 0.355457
C  1.515574 -0.488301 -0.181102
C  3.876435 0.175642 0.044915
C  3.890195 1.703588 -0.040486
H  -0.004978 1.646548 -0.277376
H  -0.66009 1.430398 1.367952
H  -2.108731 -0.753417 1.867679
H  -2.396536 -1.884484 0.512177
H  0.432515 -0.796691 1.630793
H  -2.304072 1.912077 -1.201908
H  -2.015299 3.105885 0.093459
H  -4.408738 -0.440121 0.93825
H  -3.736546 -0.206062 -0.698295
H  -3.273871 1.662068 1.724509
H  -4.299545 2.016865 0.311497
H  -0.513209 -3.004523 1.035494
H  1.208252 -3.021877 0.572711
H  -0.058999 -2.790692 -0.683146
H  -0.354026 -0.365505 -1.845019
H  4.652249 -0.211168 0.724406
H  3.973958 -0.285386 -0.953413
H  4.871944 2.045149 -0.417815
H  3.111777 2.064746 -0.733062
H  3.726196 2.156452 0.952441
