program: Gaussian 09
title: 000026884
version: EM64L-G09RevD.01
frameworkgroup: C1[X(C11H13NO3)]
method: RPBEPBE
basis: SDD
operation: Freq
keyword: #p
keyword: freq=noraman
keyword: PBEPBE/SDD
title: #p freq=noraman PBEPBE/SDD
converged: YES YES NO NO
title: Mulliken charges:
elementType: O O O N C C C C C C C C C C C H H H H H H H H H H H H H
charge: -0.291029 -0.274634 -0.283542 -0.633448 0.550936 0.214334 0.221650 -0.507084 -0.439737 -0.344213 -0.264569 -0.356269 -0.521871 -0.535362 0.216802 0.249465 0.237821 0.241667 0.270157 0.207477 0.257233 0.212027 0.231294 0.230913 0.224271 0.246386 0.307497 0.331826
chargesum: 0.00000
title: Mulliken charges with hydrogens summed into heavy atoms:
elementType: O O O N C C C C C C C C C C C
charge: -0.291029 -0.274634 -0.283542 0.005875 0.550936 0.214334 0.221650 -0.257618 -0.201916 -0.102546 0.005588 -0.148792 0.178684 0.166209 0.216802
polarizability: 2.72804794e+02 -1.40134141e+01 1.47948817e+02 7.78030697e-01 -5.03554753e+00 6.71673522e+01
1716.lowfreq: -2.4559 -0.0005 -0.0005 -0.0003 4.6753 10.6077 38.6158 52.3126 68.9423
frequency: 38.6139 52.2711 68.9301 77.7214 107.4222 125.6657 152.6065 174.5432 190.0800 202.6893 223.7387 253.8118 264.7748 317.3762 356.6347 393.6007 449.9978 468.4626 474.7768 493.3822 504.0648 553.5945 594.7612 608.8266 631.1820 703.2680 713.3498 739.7152 751.8255 810.1535 871.6462 894.0405 900.1206 921.1646 935.6869 981.9131 999.7356 1011.5856 1044.1484 1111.0175 1113.1273 1116.3718 1145.4769 1157.1484 1177.4417 1210.7157 1235.5481 1253.9365 1265.2017 1311.8941 1361.6901 1382.9507 1414.4336 1435.0835 1443.8064 1457.3125 1467.7111 1472.9197 1481.5285 1496.0917 1566.9727 1572.8384 1611.8130 1620.5158 1657.2056 2967.2068 2974.8332 3058.9030 3083.6916 3096.8412 3110.5198 3127.4709 3128.8427 3135.9572 3158.8659 3165.5738 3523.0345 3680.6232
redmass: 4.2531 4.8206 3.1463 3.2039 3.9317 2.2692 1.8750 2.2016 3.5837 4.9197 2.3103 1.4825 4.4502 3.7287 3.8835 3.6987 4.0195 3.1011 1.2881 5.0563 3.7172 1.3136 4.1822 4.4592 3.3096 4.1892 5.4149 3.5367 4.9628 1.4813 1.8591 2.2900 2.8927 2.9925 1.3594 8.7752 3.2498 1.2158 2.0294 1.2422 1.2587 2.5318 1.5090 1.4217 1.6338 1.5049 1.5731 4.1207 1.4101 1.5991 3.6538 4.4334 2.0452 1.2508 1.5640 1.0798 1.0504 1.1075 1.0543 2.5473 6.5211 2.9353 4.7849 1.8127 5.5855 1.0324 1.0348 1.1043 1.0972 1.0908 1.0895 1.1044 1.1000 1.0890 1.0910 1.0946 1.0445 1.1044
irintensity: 11.4980 1.5236 1.1200 10.0161 6.2217 5.9975 1.8633 4.4882 1.2434 0.7484 0.8421 0.0994 0.3014 12.1832 6.7106 1.6632 9.0871 23.8054 149.8001 35.3268 1.8845 100.4325 19.2159 5.3184 25.2062 8.1931 11.9144 1.9560 0.4465 58.4857 24.6633 4.4309 18.4907 23.8987 2.2067 56.2496 39.9222 46.7709 16.9529 12.7280 0.5530 111.1638 7.2811 19.3843 8.1115 18.2228 3.5271 592.9304 11.7393 5.8575 120.3545 106.3987 13.9959 0.1795 61.6909 12.0882 15.9997 97.1284 23.3242 195.7402 48.5155 294.3123 19.7632 166.1321 177.0223 77.8002 86.8848 41.0438 38.3660 0.0294 17.8518 16.0357 24.9991 5.0688 7.6774 11.8823 61.2026 24.8493
temp: 298.150 k
press: 1.00000 atm
elementType: 8 8 8 7 6 6 6 6 6 6 6 6 6 6 6 1 1 1 1 1 1 1 1 1 1 1 1 1
symmnumber: 1
zpe: 579058.4 jmol-1
zpe.correction: 0.220552 hartree
zpe.thermalcorrener: 0.235995 hartree
zpe.thermalcorrenthalpy: 0.236939 hartree
zpe.thermalcorrgfe: 0.177171 hartree
zpe.sumelectzpe: -706.252078 hartree
zpe.sumelectthermal: -706.236635 hartree
zpe.sumelectthermalent: -706.235691 hartree
zpe.sumelectthermalfe: -706.295458 hartree
dipole: 4.2753 1.6344 0.8100
dipole: 4.6482
quadrupole: -76.0093 -77.7243 -93.0972
quadrupole: -26.4577 6.3532 2.4121
quadrupole: 6.2676 4.5526 -10.8202 -26.4577 6.3532 2.4121
hfenergy: -706.4726294 hartree
pointgroup: C01 [X(C11H13N1O3)]
dipole: -1.6562284 0.7144301 -0.3012911 debye
polarizability: 273.74693|8.8876346|146.9058724|-0.2208519|5.7287273|67.2681602 unknown
InChI: InChI=1S/C11H13NO3/c1-14-9-5-3-8(4-6-11(12)13)7-10(9)15-2/h3-7H,12H2,1-2H3
charge 0 multiplicity 1
28 atoms
O  -1.978955 2.156314 0.265184
O  -3.67572 -0.107517 0.020132
O  4.839569 -1.294475 -0.375974
N  5.309143 0.954641 -0.038617
C  0.559587 -0.52651 -0.193211
C  -1.469973 0.870354 0.016323
C  -2.291849 -0.301332 -0.08958
C  -0.072852 0.739885 -0.030889
C  -0.272895 -1.670741 -0.321842
C  -1.676824 -1.562784 -0.270968
C  2.014481 -0.699741 -0.240132
C  2.978102 0.26202 -0.114352
C  -3.018254 2.675905 -0.648617
C  -4.532242 -1.29856 0.004318
C  4.420374 -0.107715 -0.18924
H  0.511683 1.659933 0.067272
H  0.1878 -2.655988 -0.457161
H  -2.286699 -2.466608 -0.35944
H  2.386501 -1.723998 -0.393306
H  2.72151 1.317607 0.046427
H  -3.929099 2.057203 -0.606597
H  -2.632534 2.715723 -1.685953
H  -3.224984 3.695069 -0.288371
H  -4.272565 -1.984829 0.832536
H  -4.459956 -1.833235 -0.962191
H  -5.553959 -0.916433 0.143116
H  4.995934 1.910763 0.117006
H  6.307876 0.756047 -0.078872
