program: Gaussian 09
title: 000298225
version: EM64L-G09RevD.01
frameworkgroup: C1[X(C7H14O6)]
method: RPBEPBE
basis: SDD
operation: Freq
keyword: #pfreq=noraman
keyword: PBEPBE/SDD
title: #p freq=noraman PBEPBE/SDD
converged: YES YES NO NO
title: Mulliken charges:
elementType: O O O O O O C C C C C C C H H H H H H H H H H H H H H
charge: -0.303570 -0.482404 -0.446907 -0.470560 -0.489963 -0.255759 -0.129757 0.002684 -0.054558 -0.161014 -0.388056 -0.073492 -0.516485 0.275048 0.205816 0.249226 0.224844 0.219063 0.243196 0.348570 0.228454 0.373365 0.362724 0.202449 0.242750 0.229805 0.364531
chargesum: 0.00000
title: Mulliken charges with hydrogens summed into heavy atoms:
elementType: O O O O O O C C C C C C C
charge: -0.303570 -0.133833 -0.073542 -0.107836 -0.125432 -0.255759 0.145291 0.208500 0.194668 0.063830 0.074202 0.154962 0.158519
polarizability: 9.83899124e+01 -1.31472194e+00 1.07350478e+02 -8.14349874e-01 -1.94753145e+00 8.48997036e+01
1716.lowfreq: -0.0013 -0.0011 -0.0007 8.5739 11.6067 12.9841 49.7226 51.6413 72.7599
frequency: 49.5941 51.5328 72.7497 95.4955 109.5833 139.1057 165.9788 172.9657 193.5692 213.3199 234.8466 255.3863 265.0326 286.0099 296.8179 322.5811 349.4230 401.2507 402.8953 461.8621 535.5161 569.1823 609.7069 623.6043 684.9675 705.7444 802.6734 818.3321 889.4139 908.5558 938.4978 963.0181 981.7540 1002.5460 1045.4948 1058.2536 1078.4517 1084.6967 1104.7444 1120.2940 1140.5441 1162.8450 1169.8922 1217.2219 1238.0664 1251.5102 1270.7589 1281.1766 1305.9151 1325.0852 1336.2323 1343.9010 1363.4602 1381.1376 1393.6953 1416.9658 1436.4372 1454.3916 1464.6910 1482.9819 1581.6897 2920.2155 2934.7582 2946.4501 2984.8943 3009.4735 3043.8417 3053.4898 3065.3979 3083.0931 3107.9451 3363.8789 3455.9162 3579.9965 3613.1645
redmass: 6.1695 5.2169 3.5923 3.5999 3.3917 3.1750 4.5034 2.3353 2.4002 1.5367 2.7154 2.3642 1.4592 3.9410 4.1158 4.0485 4.0815 3.7935 4.0741 5.3933 1.1592 4.3434 1.1499 3.3241 3.8410 3.2761 3.8099 3.1328 3.5925 2.6607 2.3573 4.0574 4.0245 2.5514 3.0505 2.7277 3.1667 2.1912 1.9543 1.2608 1.1164 1.5500 1.0999 1.2172 1.2499 1.2460 1.4033 1.4187 1.3545 1.2386 1.2098 1.3065 1.2619 1.5003 1.5089 1.4831 1.1432 1.0539 1.0784 1.0545 7.3755 1.0797 1.0835 1.0370 1.0590 1.0843 1.0967 1.0921 1.1049 1.0860 1.1019 1.0639 1.0647 1.0666 1.0671
irintensity: 1.5191 0.9454 0.4206 2.4370 5.7295 2.8752 2.9432 4.1849 13.6127 65.1502 55.9495 81.8703 91.7720 15.7274 10.4806 5.9592 7.6272 23.5595 8.4321 6.4525 254.9656 10.4466 58.7879 32.4736 5.9594 10.2540 15.9448 61.4236 36.3319 19.5091 28.3346 64.7969 14.5762 28.8537 127.3144 70.9939 62.5013 27.2293 15.3347 1.6994 22.5789 8.9065 2.8307 11.8706 19.6202 6.8465 39.6529 9.2597 32.9372 32.3562 7.2445 3.9018 27.4946 4.2280 40.9431 4.4019 3.7793 8.9493 17.5040 9.6125 133.8479 38.3142 37.8122 86.1438 50.1005 6.6523 39.2187 28.3087 23.1378 21.2677 25.3320 47.7665 51.4839 9.1757 10.1522
temp: 298.150 k
press: 1.00000 atm
elementType: 8 8 8 8 8 8 6 6 6 6 6 6 6 1 1 1 1 1 1 1 1 1 1 1 1 1 1
symmnumber: 1
zpe: 563719.6 jmol-1
zpe.correction: 0.214709 hartree
zpe.thermalcorrener: 0.230109 hartree
zpe.thermalcorrenthalpy: 0.231053 hartree
zpe.thermalcorrgfe: 0.172456 hartree
zpe.sumelectzpe: -725.344478 hartree
zpe.sumelectthermal: -725.329078 hartree
zpe.sumelectthermalent: -725.328134 hartree
zpe.sumelectthermalfe: -725.386731 hartree
dipole: -3.3858 3.0009 0.9009
dipole: 4.6131
quadrupole: -65.9868 -77.7349 -79.4939
quadrupole: 10.5853 -0.7750 -0.4265
quadrupole: 8.4184 -3.3297 -5.0887 10.5853 -0.7750 -0.4265
hfenergy: -725.5591871 hartree
pointgroup: C01 [X(C7H14O6)]
dipole: -1.346594 -0.6388713 -1.0356296 debye
polarizability: 98.414564|0.5122646|99.7284686|1.6727557|10.7705029|92.4970617 unknown
InChI: InChI=1S/C7H14O6/c1-13-7(5(11)3-9)6(12)4(10)2-8/h3-8,10-12H,2H2,1H3
charge 0 multiplicity 1
27 atoms
O  1.155887 -1.865229 -0.283909
O  -1.299712 -0.628995 -1.88291
O  -0.660604 -0.139976 1.745415
O  1.765264 1.768829 -0.458413
O  -2.713885 1.318143 0.82342
O  1.81471 1.460033 2.191724
C  -0.568395 -0.071446 -0.717123
C  0.918639 -0.504701 -0.771952
C  -1.328171 -0.599795 0.5185
C  1.888973 0.403834 0.023787
C  -2.789397 -0.135726 0.541889
C  1.759814 0.370417 1.552814
C  0.885717 -2.913553 -1.277732
H  -0.604365 1.036313 -0.733157
H  1.233993 -0.427174 -1.838245
H  -1.27519 -1.700231 0.53279
H  2.91281 0.01336 -0.182033
H  -3.331657 -0.659011 1.354263
H  -3.263711 -0.33161 -0.436239
H  -1.067095 -0.102415 -2.687643
H  1.767841 -0.620519 2.041343
H  -1.006722 0.780072 1.919833
H  1.803599 2.34802 0.359843
H  1.51754 -2.772044 -2.179812
H  -0.17709 -2.919997 -1.582298
H  1.151782 -3.864219 -0.788903
H  -3.610671 1.676624 1.02735
