program: Gaussian 09
title: 000298224
version: EM64L-G09RevD.01
frameworkgroup: C1[X(C11H24O4S2)]
method: RPBEPBE
basis: SDD
operation: Freq
keyword: #p
keyword: freq=noraman
keyword: PBEPBE/SDD
title: #p freq=noraman PBEPBE/SDD
converged: YES YES NO NO
title: Mulliken charges:
elementType: S S O O O O C C C C C C C C C C C H H H H H H H H H H H H H H H H H H H H H H H H
charge: 0.181351 0.214671 -0.309661 -0.472705 -0.445120 -0.283611 -0.066829 -0.044047 -0.084465 -0.821393 -0.309203 -0.579370 -0.574757 -0.512433 -0.652700 -0.660215 -0.492707 0.233759 0.280890 0.246743 0.338566 0.211226 0.206913 0.359499 0.350907 0.257541 0.250438 0.263617 0.256190 0.233674 0.216052 0.214369 0.229947 0.227487 0.218377 0.225126 0.232245 0.218753 0.231264 0.203624 0.205989
chargesum: 0.00000
title: Mulliken charges with hydrogens summed into heavy atoms:
elementType: S S O O O O C C C C C C C C C C C
charge: 0.181351 0.214671 -0.309661 -0.113206 -0.094213 -0.283611 0.166930 0.236843 0.162278 -0.482827 0.108936 -0.071392 -0.054950 0.151661 0.023110 0.015910 0.148171
polarizability: 1.82938165e+02 1.48072661e+00 2.06701807e+02 4.58050384e+00 -2.62242570e+00 1.34957835e+02
1716.lowfreq: -0.0011 0.0016 0.0021 4.6445 5.9395 9.2780 21.7931 31.6343 34.7281
frequency: 21.3446 31.6266 34.7106 45.6610 51.8056 58.2126 64.6745 73.2866 82.0597 87.5904 98.1308 110.8289 127.0606 137.9563 163.0627 192.8822 210.0579 215.4980 223.8787 228.7082 239.2962 245.8200 249.3826 273.4123 322.5745 335.9005 340.7485 386.8925 416.8460 434.5268 461.4383 486.0573 529.0812 582.4716 613.2786 627.8257 654.9694 695.3305 729.1480 785.9800 793.2798 851.7949 880.8066 915.1574 942.2006 960.6813 992.8374 998.0209 1023.4627 1030.6075 1035.1587 1038.5460 1057.4384 1063.8027 1066.1338 1070.5635 1083.6033 1114.7606 1117.9442 1128.5323 1147.3706 1150.8791 1172.1894 1180.9511 1204.8511 1225.4161 1241.5382 1242.2707 1270.7619 1272.7789 1279.7771 1289.5559 1302.6584 1312.1450 1332.6126 1357.6461 1394.0552 1394.5158 1395.3889 1423.4215 1435.7005 1438.3547 1456.8361 1458.8527 1460.8397 1461.2876 1465.7502 1469.8943 1470.3090 1475.9477 1481.8981 1482.6011 1483.3041 2926.1100 2946.6834 2949.7389 2974.9283 2983.3282 2984.0858 2998.4753 2999.5932 3003.7211 3011.2111 3012.0077 3025.5237 3029.0276 3069.2678 3072.1647 3073.0191 3077.0927 3078.1000 3099.6466 3100.2402 3101.2294 3104.1718 3481.5496 3525.7591
redmass: 3.9206 3.8808 3.8662 2.9769 2.3236 2.7492 2.1139 2.5056 2.6944 3.1712 3.8526 4.2765 4.9243 4.3214 1.4432 5.2183 2.1637 2.2172 2.7025 1.8558 1.4052 1.9032 2.3101 4.2703 3.3774 4.2685 4.5920 5.3463 2.9947 1.4288 2.5277 1.2114 3.6870 5.4113 4.6758 4.7084 3.3854 4.9628 5.6241 1.1337 1.1101 5.7472 3.6554 4.4020 3.5067 2.3700 1.7746 1.7777 4.8161 1.2521 1.2157 2.2755 3.5574 2.7664 3.3271 2.2665 2.9166 1.2675 1.2872 2.0961 1.3772 1.1531 1.5208 1.1632 1.2337 1.2217 1.2313 1.2276 1.1593 1.2399 1.2600 1.2485 1.2858 1.2871 1.2698 1.3769 1.4392 1.2048 1.2078 1.7476 1.1397 1.1631 1.0519 1.0869 1.0578 1.0886 1.0659 1.0400 1.0395 1.0518 1.0684 1.0478 1.0476 1.0343 1.0328 1.0539 1.0815 1.0355 1.0354 1.0861 1.1001 1.1027 1.0571 1.0577 1.0909 1.1023 1.0907 1.1036 1.0986 1.0994 1.0994 1.1051 1.1043 1.0978 1.0994 1.0650 1.0650
irintensity: 0.0836 1.0723 1.8607 0.5224 0.9638 0.1626 0.7323 9.7249 0.2253 4.9308 3.3720 1.3987 2.4351 2.4104 0.4357 1.0868 2.1420 3.6683 0.5896 0.4337 1.5986 1.5401 13.0140 8.9633 2.2153 2.7507 1.4412 1.6855 2.1163 74.9452 32.7509 180.8348 28.6917 55.0771 2.5283 16.5234 8.3313 19.4552 7.6373 8.3057 8.4051 26.9675 34.2690 13.4484 10.8201 46.9620 16.7149 14.2622 58.7281 3.7304 0.5228 21.2793 35.8727 68.0887 67.8742 17.2482 3.9073 0.6696 1.6508 5.9172 12.7679 28.9024 3.1720 98.6017 27.2069 25.3070 0.8861 0.9740 17.7110 16.3525 15.0792 0.2013 25.2005 3.8335 9.1345 21.8297 1.3507 16.1026 19.2595 1.4415 1.5848 0.7961 13.9144 4.7369 10.0820 4.0995 13.8716 14.3677 14.9109 13.7137 3.5984 9.3159 7.9815 84.0570 55.9620 66.5483 15.8892 47.0874 34.2705 10.5051 102.9897 1.0504 13.3156 25.3175 52.9985 40.9179 4.0270 5.6004 4.3546 23.6779 24.7339 39.2499 37.6911 34.2022 30.8473 18.7435 15.0134
temp: 298.150 k
press: 1.00000 atm
elementType: 16 16 8 8 8 8 6 6 6 6 6 6 6 6 6 6 6 1 1 1 1 1 1 1 1 1 1 1 1 1 1 1 1 1 1 1 1 1 1 1 1
symmnumber: 1
zpe: 897763.8 jmol-1
zpe.correction: 0.341940 hartree
zpe.thermalcorrener: 0.365791 hartree
zpe.thermalcorrenthalpy: 0.366735 hartree
zpe.thermalcorrgfe: 0.285575 hartree
zpe.sumelectzpe: -1529.099004 hartree
zpe.sumelectthermal: -1529.075153 hartree
zpe.sumelectthermalent: -1529.074209 hartree
zpe.sumelectthermalfe: -1529.155370 hartree
dipole: 1.4588 1.0999 -2.2870
dipole: 2.9272
quadrupole: -110.8237 -103.3325 -122.8399
quadrupole: 0.3508 4.6822 -1.9062
quadrupole: 1.5083 8.9995 -10.5078 0.3508 4.6822 -1.9062
hfenergy: -1529.4409441 hartree
pointgroup: C01 [X(C11H24O4S2)]
dipole: 0.5574051 0.4124059 -0.9195036 debye
polarizability: 183.4079926|2.457787|206.5512352|2.5419202|-2.3740388|134.6385793 unknown
InChI: InChI=1S/C11H24O4S2/c1-5-16-11(17-6-2)10(13)9(12)8(15-4)7-14-3/h8-13H,5-7H2,1-4H3
charge 0 multiplicity 1
41 atoms
S  -2.576415 1.520263 0.794148
S  -2.392582 -1.536211 0.672801
O  2.935766 -1.983096 -0.476526
O  0.505774 -0.94753 -1.594346
O  0.029855 -0.026971 1.934648
O  2.546521 1.620919 0.169384
C  0.749717 -0.962776 -0.143188
C  -0.115114 0.141152 0.484114
C  2.261394 -0.804548 0.13414
C  -1.588784 0.051331 0.0610
C  2.939503 0.396862 -0.540557
C  -1.905321 2.945149 -0.285128
C  -3.753518 -1.640352 -0.651031
C  3.01718 -3.138201 0.424033
C  -2.825009 4.166989 -0.141871
C  -4.728939 -2.770267 -0.295019
C  3.226137 2.796312 -0.371274
H  0.417681 -1.931884 0.285013
H  0.285129 1.126051 0.17026
H  2.433986 -0.76451 1.227567
H  -1.672414 0.087116 -1.037375
H  4.038677 0.252923 -0.480137
H  2.641147 0.456579 -1.609131
H  1.141931 -1.605338 -1.981587
H  -0.602611 0.614377 2.359469
H  -0.876043 3.175707 0.037767
H  -1.881107 2.576954 -1.325993
H  -4.259307 -0.659294 -0.666218
H  -3.261174 -1.816075 -1.623021
H  3.522154 -3.933427 -0.147175
H  2.015504 -3.492618 0.740668
H  3.612949 -2.893212 1.326461
H  -3.851977 3.933107 -0.473101
H  -2.87303 4.51314 0.906264
H  -2.444928 5.003371 -0.757947
H  -4.214936 -3.747096 -0.244337
H  -5.21268 -2.584516 0.680185
H  -5.521534 -2.843323 -1.062844
H  2.890258 3.65525 0.231037
H  2.964543 2.965161 -1.43792
H  4.329618 2.698434 -0.287234
