program: Gaussian 09
title: 000298847
version: EM64L-G09RevD.01
frameworkgroup: C1[X(C15H20O3)]
method: RPBEPBE
basis: SDD
operation: Freq
keyword: #pfreq=noraman
keyword: PBEPBE/SDD
title: #p freq=noraman PBEPBE/SDD
converged: YES YES NO NO
title: Mulliken charges:
elementType: O O O C C C C C C C C C C C C C C C H H H H H H H H H H H H H H H H H H H H
charge: -0.279775 -0.197514 -0.214638 -0.438309 -0.297674 -0.352186 -0.356850 0.090565 0.232984 0.299197 -0.700138 -0.345915 -0.358586 -0.264741 -0.257961 -0.228542 -0.223882 -0.661980 0.251448 0.201081 0.256280 0.178625 0.221427 0.206808 0.191629 0.216442 0.213886 0.207585 0.272317 0.278239 0.237131 0.222727 0.231631 0.234558 0.233822 0.218963 0.225442 0.255906
chargesum: 0.00000
title: Mulliken charges with hydrogens summed into heavy atoms:
elementType: O O O C C C C C C C C C C C C C C C
charge: -0.279775 -0.197514 -0.214638 0.014220 -0.041394 0.047866 0.041586 0.090565 0.232984 0.299197 -0.062225 -0.073598 -0.080347 0.195117 -0.026330 0.006016 0.009940 0.038330
polarizability: 1.99807236e+02 1.50510585e+01 1.75702862e+02 2.26518954e+01 -1.08170874e+01 1.38395756e+02
1716.lowfreq: -12.6622 -4.0241 -0.0006 0.0004 0.0005 1.7962 11.7162 23.2492 39.0016
frequency: 10.2845 23.0194 38.9934 49.1793 52.7714 57.0440 88.0415 97.4615 123.6185 136.2269 150.5371 180.0907 182.6235 217.9799 228.1512 246.9659 255.4504 308.6736 338.3338 398.7062 400.4795 406.8601 426.7549 466.8458 486.2437 601.7313 612.5512 640.2404 680.2436 695.0463 708.7917 726.7561 749.7416 774.0935 800.1820 813.2595 844.2150 860.4356 879.9992 918.8376 929.8940 953.6167 958.2836 988.4008 993.4014 1010.4792 1012.4161 1016.9589 1028.1350 1057.4287 1071.1323 1087.2764 1089.2545 1099.7597 1113.5970 1125.7942 1155.3372 1173.7668 1194.9908 1207.7596 1233.0136 1243.1626 1267.2678 1277.8422 1286.0764 1293.4800 1313.9940 1330.3786 1341.0067 1354.4214 1355.4964 1386.8567 1388.5640 1393.8952 1435.5521 1450.6045 1455.5056 1462.1729 1464.7638 1474.1916 1477.3740 1480.6668 1484.3944 1485.9476 1569.2497 1595.6952 1610.8571 1643.5074 2957.9293 2968.2283 2971.6534 2990.1702 2993.4298 3008.9746 3029.5917 3033.0385 3042.7177 3067.2558 3071.6276 3074.4806 3087.1727 3094.7583 3120.1065 3128.9700 3140.7949 3154.0232 3164.2238 3171.9793
redmass: 4.7942 4.0463 3.9542 2.6282 1.7006 4.1371 3.3252 5.4415 2.6735 5.4696 3.8758 3.9113 1.6306 2.1485 1.1971 3.3682 2.5921 3.3378 5.9849 3.1285 2.8652 3.7646 3.9352 4.6919 4.6794 5.4069 6.4174 3.8413 5.7715 2.0251 2.4582 1.3660 1.7091 2.0459 1.7508 1.3892 2.5700 1.2545 2.4864 2.3551 1.6427 1.5794 2.6755 3.4698 1.6678 1.3744 2.8808 3.4887 2.0906 2.1262 2.4939 2.8749 1.6803 2.3087 2.2049 2.0564 1.6639 1.0649 1.1466 1.5896 2.3756 1.4749 1.4334 1.1175 1.3113 1.0792 1.2953 1.3500 1.3288 1.3234 1.5260 8.4415 1.2175 1.2312 2.2560 1.0836 1.0920 1.0448 1.0732 1.0680 1.0448 2.1368 1.0511 1.0775 6.9691 6.6267 6.1868 9.2288 1.0615 1.0605 1.0368 1.0663 1.0363 1.0942 1.0597 1.0980 1.0855 1.1002 1.0992 1.0998 1.0977 1.1030 1.1057 1.0854 1.0890 1.0933 1.0956 1.0999
irintensity: 1.0065 0.6476 0.9952 0.2604 0.0370 0.2165 0.4997 1.2848 0.6883 2.0266 0.2040 3.3843 1.5657 1.0384 0.3617 3.1975 0.8792 11.5786 4.5053 1.8046 0.5266 1.5078 1.5346 1.8701 19.1934 11.2795 0.3616 2.1346 6.0145 45.1093 14.2896 18.9753 6.1160 44.5726 0.8336 5.5246 0.7590 1.0697 10.2888 24.5886 18.2651 4.0003 44.5860 2.8264 1.1990 1.1654 15.6508 57.3955 2.7569 6.1557 93.8546 180.7779 5.6123 22.5280 32.0799 2.9293 12.5246 3.3782 15.7646 32.4243 161.8594 109.2920 52.4129 3.1047 22.6264 8.3124 8.6469 6.1205 6.4726 4.7832 1.5838 3.5617 10.1634 21.1432 21.4251 13.0136 13.4555 16.4218 0.2756 4.6824 12.5490 0.6562 17.1918 15.1463 75.2515 27.7599 15.7006 186.8038 10.1737 52.6985 37.3261 27.3805 16.5202 7.5161 33.8271 20.4314 10.5045 37.4935 55.3960 57.1606 39.6564 1.8786 27.6371 0.2654 13.0609 11.6415 12.8599 19.7576
temp: 298.150 k
press: 1.00000 atm
elementType: 8 8 8 6 6 6 6 6 6 6 6 6 6 6 6 6 6 6 1 1 1 1 1 1 1 1 1 1 1 1 1 1 1 1 1 1 1 1
symmnumber: 1
zpe: 830042.1 jmol-1
zpe.correction: 0.316146 hartree
zpe.thermalcorrener: 0.335600 hartree
zpe.thermalcorrenthalpy: 0.336544 hartree
zpe.thermalcorrgfe: 0.264522 hartree
zpe.sumelectzpe: -807.908268 hartree
zpe.sumelectthermal: -807.888814 hartree
zpe.sumelectthermalent: -807.887870 hartree
zpe.sumelectthermalfe: -807.959892 hartree
dipole: -2.9292 0.2723 -3.5885
dipole: 4.6403
quadrupole: -96.3509 -98.7523 -114.0811
quadrupole: 1.4850 0.5104 -5.2993
quadrupole: 6.7106 4.3091 -11.0197 1.4850 0.5104 -5.2993
hfenergy: -808.2244142 hartree
pointgroup: C01 [X(C15H20O3)]
dipole: -0.5154212 0.9127366 -1.4947103 debye
polarizability: 198.5729305|-7.446062|173.4653537|19.423033|-23.9569997|141.8675699 unknown
InChI: InChI=1S/C15H20O3/c1-3-5-11-13(15(17)18-4-2)14(16)12-9-7-6-8-10-12/h6-10,13H,3-5,11H2,1-2H3
charge 0 multiplicity 1
38 atoms
O  1.280327 2.279182 -0.695531
O  -0.212571 -1.35505 1.428824
O  1.66087 1.704834 1.536204
C  2.34501 -0.961434 0.344818
C  1.166622 -0.067486 -0.125087
C  2.362581 -2.345234 -0.339999
C  3.544917 -3.217847 0.139827
C  -0.194492 -0.597857 0.418832
C  1.387426 1.367349 0.364481
C  -1.469258 -0.206967 -0.272573
C  3.581456 -4.602812 -0.541258
C  -1.51037 0.689128 -1.376109
C  -2.684629 -0.768478 0.210337
C  1.471574 3.725722 -0.3488
C  -2.743595 1.008252 -1.984373
C  -3.912408 -0.449747 -0.399695
C  -3.945176 0.439447 -1.502096
C  0.174276 4.337434 0.186768
H  2.269435 -1.082017 1.439946
H  3.297346 -0.435229 0.134609
H  1.125877 -0.038761 -1.228077
H  2.425066 -2.219083 -1.441779
H  1.414089 -2.876601 -0.129134
H  3.4749 -3.345703 1.238684
H  4.497975 -2.683518 -0.052626
H  4.431702 -5.209577 -0.179143
H  2.652226 -5.167615 -0.33768
H  3.679859 -4.503623 -1.639012
H  -0.592375 1.153619 -1.747732
H  -2.633481 -1.451266 1.064836
H  2.285992 3.798197 0.393355
H  1.784143 4.177576 -1.303683
H  -2.768278 1.699314 -2.834059
H  -4.842086 -0.88954 -0.022599
H  -4.899954 0.686788 -1.979771
H  0.316095 5.421868 0.35077
H  -0.654255 4.202342 -0.530022
H  -0.106734 3.878391 1.148945
