program: Gaussian 09
title: 000298236
version: EM64L-G09RevD.01
frameworkgroup: C1[X(C15H21NO7)]
method: RPBEPBE
basis: SDD
operation: Freq
keyword: #p
keyword: freq=noraman
keyword: PBEPBE/SDD
title: #p freq=noraman PBEPBE/SDD
converged: YES YES NO NO
title: Mulliken charges:
elementType: O O O O O O O N C C C C C C C C C C C C C C C H H H H H H H H H H H H H H H H H H H H H
charge: -0.446829 -0.443496 -0.470697 -0.483728 -0.320752 -0.276575 -0.245684 -0.379265 -0.105208 -0.122497 -0.116748 -0.179199 -0.440668 -0.296393 0.260565 0.206485 0.222414 -0.772906 -0.340091 -0.334822 -0.219786 -0.218110 -0.221242 0.259095 0.253120 0.249069 0.275668 0.251750 0.260838 0.234873 0.264411 0.357364 0.358604 0.307527 0.346084 0.365582 0.257575 0.258321 0.212457 0.270487 0.260673 0.234862 0.233085 0.233786
chargesum: 0.00000
title: Mulliken charges with hydrogens summed into heavy atoms:
elementType: O O O O O O O N C C C C C C C C C C C C C C C
charge: -0.089465 -0.084892 -0.124613 -0.118146 -0.320752 -0.276575 -0.245684 -0.071738 0.153887 0.130622 0.132322 0.096469 0.071920 0.202891 0.260565 0.206485 0.222414 -0.044553 -0.069604 -0.074149 0.015076 0.014975 0.012544
polarizability: 2.46268797e+02 2.42886511e+01 1.72575329e+02 -5.11383410e+00 -1.63743126e+01 1.61425127e+02
1716.lowfreq: -12.4091 -6.7805 -0.0004 0.0007 0.0007 3.1613 11.4201 12.5534 28.6263
frequency: 10.6213 12.2500 28.3337 36.8182 53.7972 61.1167 68.8380 73.7244 91.1126 98.7949 103.6817 114.3318 127.1689 152.9574 193.4185 205.2860 222.0883 232.5738 248.5126 277.2933 277.3809 285.5862 303.3750 333.7489 344.9619 365.0023 402.9280 425.5084 431.5123 436.2258 438.3819 459.5097 484.0183 493.0107 503.5032 543.5535 544.8787 608.9198 613.4954 614.0841 659.2944 672.5260 679.5493 701.0349 710.3727 792.4780 794.5228 821.9046 848.6798 854.5863 863.6383 894.2525 918.7189 926.4554 952.7842 978.5652 984.0887 990.3046 994.6327 1005.2158 1008.7818 1021.0769 1035.6241 1042.5310 1054.1193 1058.2132 1067.6066 1072.1932 1086.7988 1091.5842 1116.8406 1174.5154 1180.6275 1183.2111 1185.9330 1207.2299 1222.2784 1235.8334 1244.1603 1258.9722 1261.3176 1294.5880 1302.5423 1312.5578 1315.3143 1325.3413 1339.6163 1351.3177 1357.8601 1384.1521 1389.9244 1390.2882 1395.5641 1424.8232 1432.9608 1438.5160 1449.0207 1458.7726 1462.5943 1477.8361 1477.9962 1585.5861 1608.4900 1611.4831 1626.6867 2970.4449 2985.4778 2997.6087 2998.2336 3012.7200 3020.2492 3022.7884 3096.6121 3098.0582 3098.9327 3101.6435 3131.2098 3143.5872 3155.5993 3167.0665 3177.5272 3511.3555 3538.8259 3555.5674 3560.4770 3573.3155
redmass: 5.5176 5.1631 5.7114 4.6032 5.6484 2.4798 2.5113 2.7943 6.4615 3.6892 4.2416 5.0478 4.9637 4.9320 4.6987 4.9154 4.6098 3.0381 4.2902 4.8822 1.2890 4.7608 3.1689 5.3225 3.8378 6.5691 2.8207 1.6429 1.5583 2.0062 1.9108 3.2621 2.0105 1.4460 3.4036 1.4744 3.1027 2.6862 3.3935 6.4164 6.6864 3.9694 5.1037 1.5992 3.8908 5.7233 2.1797 2.8467 3.5931 3.7141 1.2457 3.2464 2.9202 6.7385 1.4239 1.7561 3.2919 5.4899 1.4304 3.4030 1.3354 2.7474 2.5850 1.6631 2.9450 2.6351 2.7301 2.5813 1.8529 2.3265 2.8275 1.0567 1.1588 1.1774 1.1567 1.1656 1.3358 1.4145 2.0468 1.5664 1.3474 1.3078 1.2603 1.2976 1.3139 1.3354 1.2833 1.2375 1.2966 1.5312 4.6494 1.4631 1.5617 1.7093 1.1986 2.2466 1.0459 1.0836 1.2057 1.6969 2.0722 6.6739 6.1955 6.1125 10.9689 1.0828 1.0846 1.0381 1.0847 1.0837 1.0613 1.0588 1.1069 1.0987 1.1017 1.0999 1.0855 1.0890 1.0937 1.0975 1.0986 1.0645 1.0650 1.0654 1.0788 1.0660
irintensity: 0.4329 0.9226 0.6049 3.9117 1.9349 1.1352 7.6937 1.2853 4.2431 1.4684 3.6044 11.6189 1.1281 2.4430 1.4155 4.0457 1.0593 38.6711 6.1361 1.4888 147.2688 38.5870 1.8325 8.2211 2.7714 1.5661 0.0177 7.8709 43.7567 131.6502 107.9097 13.8234 39.1161 198.8699 34.7628 40.0312 47.6418 18.7899 11.8743 0.3176 2.9958 31.9170 10.8876 84.4683 31.4754 24.4253 24.5343 7.2414 8.5508 15.8168 0.3871 10.8985 26.7757 4.6576 2.5067 16.7036 128.3311 3.8738 0.0381 273.7320 1.5455 56.6077 6.8186 17.8125 174.2260 56.8038 25.5404 14.1250 23.3097 15.5337 9.1264 0.2163 32.2297 32.0854 20.5315 17.2421 112.4164 41.9776 216.7320 84.0510 1.6427 12.2824 41.0679 66.0480 2.3222 3.6257 2.7323 8.5449 0.5157 2.3284 16.2018 56.6116 10.4114 10.3723 39.1276 16.4444 18.3705 13.2380 98.5653 74.2534 20.4905 29.8194 172.2072 7.6245 168.7700 4.7465 47.4621 5.7688 26.0854 41.6862 14.6055 11.9833 21.1339 10.0738 7.3530 17.0502 0.2377 9.2563 14.7125 22.7630 9.1734 17.9934 16.5846 27.3527 20.4178 4.2242
temp: 298.150 k
press: 1.00000 atm
elementType: 8 8 8 8 8 8 8 7 6 6 6 6 6 6 6 6 6 6 6 6 6 6 6 1 1 1 1 1 1 1 1 1 1 1 1 1 1 1 1 1 1 1 1 1
symmnumber: 1
zpe: 916976.4 jmol-1
zpe.correction: 0.349258 hartree
zpe.thermalcorrener: 0.373910 hartree
zpe.thermalcorrenthalpy: 0.374854 hartree
zpe.thermalcorrgfe: 0.290949 hartree
zpe.sumelectzpe: -1163.742135 hartree
zpe.sumelectthermal: -1163.717483 hartree
zpe.sumelectthermalent: -1163.716539 hartree
zpe.sumelectthermalfe: -1163.800444 hartree
dipole: -0.8650 6.8998 -0.2220
dipole: 6.9574
quadrupole: -99.5939 -138.5325 -138.4545
quadrupole: -21.5910 -9.8868 1.9625
quadrupole: 25.9331 -13.0056 -12.9276 -21.5910 -9.8868 1.9625
hfenergy: -1164.091393 hartree
pointgroup: C01 [X(C15H21N1O7)]
dipole: -0.5561191 -2.6796472 -0.0526519 debye
polarizability: 241.791665|-29.7095751|178.5116966|3.8928395|-16.4727744|159.9658913 unknown
InChI: InChI=1S/C15H21NO7/c1-9(17)16-7-11(18)13(20)14(21)12(19)8-23-15(22)10-5-3-2-4-6-10/h2-6,11-14,16,18-21H,7-8H2,1H3
charge 0 multiplicity 1
44 atoms
O  -4.18917 2.58077 -0.081706
O  -1.582825 3.408898 0.933432
O  -4.086095 0.591501 -1.989266
O  -0.164285 1.467134 2.213352
O  1.380824 0.538445 0.158073
O  -2.026649 -2.332313 0.338314
O  2.336533 1.162693 -1.870764
N  -4.229108 -1.757366 -0.09785
C  -2.924877 1.888693 -0.367504
C  -2.050974 2.0212 0.887331
C  -3.242503 0.435532 -0.782442
C  -0.819022 1.079862 0.944016
C  -4.003969 -0.354566 0.305207
C  0.152216 1.295509 -0.222532
C  -3.198201 -2.684614 -0.006657
C  2.424467 0.547218 -0.781283
C  3.603828 -0.240439 -0.322907
C  -3.556238 -4.127396 -0.341292
C  4.781091 -0.189858 -1.114606
C  3.578392 -1.028474 0.857391
C  5.925828 -0.913585 -0.724096
C  4.725587 -1.753958 1.241968
C  5.900792 -1.695824 0.455507
H  -2.407341 2.379877 -1.217951
H  -2.670749 1.801569 1.782127
H  -2.317162 -0.112226 -1.04411
H  -1.119511 0.01418 0.98869
H  -3.422438 -0.353971 1.244846
H  -4.975096 0.133379 0.490664
H  -0.227766 0.897006 -1.179581
H  0.407991 2.361681 -0.347729
H  -4.732492 2.520517 -0.910817
H  -0.979719 3.461147 1.722788
H  -5.180008 -2.078803 -0.282251
H  -4.282226 -0.306047 -2.357624
H  0.739619 1.059366 2.220436
H  -2.890129 -4.490959 -1.142216
H  -3.371503 -4.758862 0.545076
H  -4.604654 -4.25962 -0.660054
H  4.77524 0.419114 -2.024699
H  2.662201 -1.077979 1.452343
H  6.834136 -0.86995 -1.334482
H  4.704254 -2.365313 2.150529
H  6.79061 -2.258962 0.758527
