program: Gaussian 09
title: 000298233
version: EM64L-G09RevD.01
frameworkgroup: C1[X(C13H22O8S)]
method: RPBEPBE
basis: SDD
operation: Freq
keyword: #p
keyword: freq=noraman
keyword: PBEPBE/SDD
title: #p freq=noraman PBEPBE/SDD
converged: YES YES NO NO
title: Mulliken charges:
elementType: S O O O O O O O O C C C C C C C C C C C C C H H H H H H H H H H H H H H H H H H H H H H
charge: 1.047596 -0.245110 -0.270905 -0.300087 -0.278002 -0.396789 -0.280474 -0.486161 -0.530438 -0.174906 0.330654 -0.135696 -0.075512 -0.382015 -0.491286 0.352922 0.383754 -0.688717 -0.687078 -0.712345 -0.678088 -0.747097 0.285339 0.312955 0.219774 0.215861 0.244794 0.247709 0.274397 0.238941 0.225612 0.218846 0.224735 0.217748 0.232877 0.222447 0.220040 0.248873 0.224352 0.224939 0.246531 0.332742 0.281463 0.284805
chargesum: 0.00000
title: Mulliken charges with hydrogens summed into heavy atoms:
elementType: S O O O O O O O O C C C C C C C C C C C C C
charge: 1.047596 -0.245110 -0.270905 -0.300087 -0.278002 -0.396789 -0.280474 -0.486161 -0.530438 0.110433 0.330654 0.177259 0.144262 0.078639 0.030820 0.352922 0.383754 -0.005318 -0.011719 -0.020985 0.017734 0.151913
polarizability: 2.17564997e+02 -8.98499120e-01 2.05274690e+02 5.45227095e+00 -6.33895724e-01 1.53960776e+02
1716.lowfreq: -8.6566 -5.8085 -0.0018 -0.0009 -0.0009 9.5136 32.0271 32.5962 39.4330
frequency: 31.8819 32.5621 39.2766 50.6646 66.2761 86.5351 103.8723 130.3665 141.8150 151.0980 155.4859 167.2661 173.4052 195.7455 204.5119 212.9768 220.3795 228.3093 244.3155 262.3223 276.1377 299.5472 320.7629 322.1416 325.6901 340.9412 348.9115 361.3417 382.5875 396.3805 422.8654 446.0653 456.6936 469.2501 480.1003 531.5763 561.1123 589.7502 597.4307 610.9423 618.8450 691.0385 706.8000 730.9347 740.3106 758.3439 787.5546 818.8627 828.3416 839.9997 876.7997 904.1220 918.6861 921.0331 923.2454 933.1212 943.1991 955.2898 972.6683 979.6572 983.1847 987.1140 991.0814 995.1634 1000.4126 1039.4659 1052.7323 1077.8043 1111.4250 1126.4525 1142.3410 1150.7798 1168.9390 1201.6684 1207.8754 1222.3323 1237.5992 1243.6041 1253.3208 1261.3697 1276.3449 1298.1768 1307.3899 1326.3475 1327.2325 1335.4790 1342.9351 1366.6913 1379.4066 1380.1603 1390.3382 1394.9898 1413.0312 1431.1414 1448.2371 1448.4764 1450.2869 1452.1564 1458.2635 1468.2768 1469.8388 1471.3718 1476.3914 1493.9085 2958.4526 2996.5297 2997.9594 3004.2725 3005.9251 3008.4897 3009.3005 3014.5220 3017.8233 3088.0183 3098.2605 3099.2782 3100.4814 3100.7510 3104.2262 3105.6875 3108.1420 3108.8327 3113.5593 3119.1308 3157.5238 3182.6791
redmass: 4.4380 5.5023 4.4076 4.4428 4.9025 4.2472 4.2156 3.9486 5.7539 1.0756 4.5824 4.4113 1.0790 4.0720 1.1700 1.1106 1.1439 4.1390 2.9400 3.7948 2.7790 2.7544 3.9676 3.3384 2.7596 5.5032 3.8675 4.8677 3.7106 5.6523 2.9677 4.6492 4.2110 3.5954 3.7899 5.6284 7.3060 8.9539 4.3691 4.6869 5.2383 4.8438 6.2873 8.0790 3.8351 3.5256 5.2244 7.1674 10.8794 4.5911 3.4851 2.5315 1.7009 1.4815 3.3350 3.5546 2.0267 2.5460 3.4323 3.0181 1.3582 1.5030 3.5276 3.0755 1.6468 3.1114 1.7439 3.3047 2.4512 2.1265 1.8445 2.2831 1.7889 2.4244 2.6802 1.5235 2.1297 1.4884 1.8922 1.5577 2.1903 1.3964 1.3767 1.1354 1.4957 1.3173 1.4066 1.2681 1.3093 1.2826 1.2264 1.2250 1.0490 1.0524 1.0806 1.0486 1.0528 1.0497 1.0490 1.0636 1.0666 1.0464 1.0524 1.0719 1.0830 1.0353 1.0355 1.0362 1.0356 1.0656 1.0275 1.0612 1.0813 1.0869 1.1000 1.1004 1.1000 1.1055 1.1000 1.1008 1.0996 1.0994 1.1003 1.1009 1.1080 1.1075
irintensity: 1.4176 3.0846 2.1466 3.5958 0.7741 4.2481 0.8251 0.8388 7.3383 0.2689 2.1642 2.6993 0.0614 0.5526 0.4546 0.9964 0.6114 2.3583 2.7074 0.5249 13.7987 9.1210 18.3251 6.2611 2.8085 35.4038 6.7687 12.4979 7.8539 1.5603 5.5849 5.2190 15.8573 8.2798 24.0178 20.5414 20.1570 50.3735 2.2374 1.4241 3.1493 20.8654 10.8121 10.6159 13.3826 25.3273 26.1861 118.0580 112.8293 11.8800 31.3503 5.7266 11.5790 0.6341 56.4895 17.2591 25.8786 7.2924 99.9799 77.6562 10.0518 10.0715 25.9152 158.7282 25.4831 84.3979 60.2222 56.8238 3.2625 26.8044 16.8026 14.7850 19.9878 250.8663 67.2415 15.1320 25.2375 10.5839 10.4881 23.5525 16.3862 8.1280 7.0639 2.4381 2.1004 7.4083 8.4978 1.6931 50.4117 42.7365 31.1740 26.3027 7.3223 16.2735 11.6752 1.1470 2.0033 4.5068 2.3658 2.9419 1.8450 16.1947 18.1837 12.8888 36.3882 14.1022 9.6838 10.7173 12.7556 61.1313 18.4570 23.8441 6.2460 8.4089 5.1145 9.5379 14.9575 1.5916 8.9384 16.7723 32.6684 24.2357 25.6222 23.1649 14.1686 0.2685
temp: 298.150 k
press: 1.00000 atm
elementType: 16 8 8 8 8 8 8 8 8 6 6 6 6 6 6 6 6 6 6 6 6 6 1 1 1 1 1 1 1 1 1 1 1 1 1 1 1 1 1 1 1 1 1 1
symmnumber: 1
zpe: 908261.9 jmol-1
zpe.correction: 0.345939 hartree
zpe.thermalcorrener: 0.370048 hartree
zpe.thermalcorrenthalpy: 0.370992 hartree
zpe.thermalcorrgfe: 0.292926 hartree
zpe.sumelectzpe: -1506.480650 hartree
zpe.sumelectthermal: -1506.456541 hartree
zpe.sumelectthermalent: -1506.455597 hartree
zpe.sumelectthermalfe: -1506.533662 hartree
dipole: -3.1034 -3.0809 -1.3125
dipole: 4.5657
quadrupole: -121.3206 -138.7072 -144.8613
quadrupole: -9.6872 2.5719 4.9726
quadrupole: 13.6425 -3.7442 -9.8983 -9.6872 2.5719 4.9726
hfenergy: -1506.8265888 hartree
pointgroup: C01 [X(C13H22O8S1)]
dipole: 1.5784973 -0.5213077 0.6805884 debye
polarizability: 213.9951014|5.9995736|208.0339598|7.6897983|-3.2821609|154.7714015 unknown
InChI: InChI=1S/C13H22O8S/c1-11(2)17-7-13(21-11)10(20-22(5,14)15)9-8(6-16-13)18-12(3,4)19-9/h8-10H,6-7H2,1-5H3
charge 0 multiplicity 1
44 atoms
S  -0.70193 2.925431 -0.48985
O  0.956117 -1.741095 -0.955958
O  -2.499237 -0.480957 0.973829
O  1.925412 -0.399808 0.824429
O  -2.053555 -2.352255 -0.427001
O  -0.152913 1.46886 0.599035
O  2.864513 1.188806 -0.629049
O  -1.963056 3.684458 0.165434
O  -0.78876 2.382336 -2.023347
C  -1.052506 -0.757499 0.984848
C  1.094668 -0.406641 -0.391047
C  -0.304889 0.146971 -0.018401
C  -0.974325 -2.250935 0.578866
C  0.357352 -2.707994 -0.015622
C  1.883709 0.430301 -1.427657
C  -3.155903 -1.474827 0.04822
C  3.204777 0.318619 0.524402
C  -3.75579 -0.761711 -1.162312
C  -4.173944 -2.265348 0.877534
C  3.539378 1.212151 1.711832
C  4.297571 -0.693983 0.15254
C  0.885275 3.935865 -0.22189
H  -0.683592 -0.565956 2.004559
H  -0.887335 0.218087 -0.957778
H  -1.21358 -2.887053 1.457753
H  1.07322 -2.89429 0.807741
H  0.216861 -3.627132 -0.605462
H  2.377189 -0.256432 -2.139236
H  1.255468 1.153438 -1.969344
H  -2.983793 -0.195684 -1.708061
H  -4.537133 -0.057036 -0.830954
H  -4.206271 -1.497665 -1.850669
H  -3.669615 -2.822322 1.685548
H  -4.717477 -2.980351 0.236119
H  -4.899407 -1.572444 1.337219
H  3.786176 0.597803 2.593851
H  4.406786 1.850773 1.471863
H  2.669061 1.844088 1.950457
H  5.237176 -0.16558 -0.084831
H  4.478687 -1.377267 1.00006
H  3.996426 -1.299588 -0.718641
H  1.716606 3.249991 -0.446541
H  0.815948 4.79647 -0.902129
H  0.862636 4.22981 0.836239
