program: Gaussian 09
title: 000298207
version: EM64L-G09RevD.01
frameworkgroup: C1[X(C6H5F3N2)]
method: RPBEPBE
basis: SDD
operation: Freq
keyword: #pfreq=noraman
keyword: PBEPBE/SDD
title: #p freq=noraman PBEPBE/SDD
converged: YES YES NO NO
title: Mulliken charges:
elementType: F F F N N C C C C C C H H H H H
charge: -0.192383 -0.211896 -0.183921 -0.422315 -0.511441 0.183278 0.066745 0.198331 0.238967 -0.305405 -0.335775 0.261952 0.267231 0.339558 0.302567 0.304506
chargesum: 0.00000
title: Mulliken charges with hydrogens summed into heavy atoms:
elementType: F F F N N C C C C C C
charge: -0.192383 -0.211896 -0.183921 -0.082756 0.095632 0.183278 0.066745 0.198331 0.238967 -0.043453 -0.068544
polarizability: 1.05566294e+02 1.00287489e+01 9.51181045e+01 2.60888804e-01 2.87650315e-02 3.75036350e+01
1716.lowfreq: -28.2793 -8.2833 -4.8667 -0.0009 -0.0006 0.0007 4.0620 137.4778 145.5479
frequency: -25.9789 137.4700 145.5477 190.3482 222.8103 278.6101 294.6430 301.0621 353.6561 367.7294 434.4645 509.1857 509.9319 553.0748 569.4470 597.5645 634.8033 698.5868 704.8946 711.0155 770.8444 887.5575 950.9969 1001.3171 1134.9257 1147.2945 1194.9124 1241.2812 1269.0635 1304.4554 1385.3764 1453.9795 1483.3652 1493.0055 1591.7969 1633.1359 1675.2899 3178.8983 3200.5481 3419.0812 3542.7683 3572.8978
redmass: 3.8224 6.6948 10.6292 5.3040 1.8232 16.6638 10.2273 2.1316 8.3679 7.6181 14.3477 6.6311 4.2159 1.7816 5.2276 1.7893 3.3869 6.7859 5.7195 2.1390 1.4183 1.3006 6.4282 4.7665 1.4314 5.0215 2.5698 3.3359 1.1550 3.8367 4.6641 2.5796 4.7456 2.2822 5.7422 8.2786 1.0822 1.0895 1.0974 1.0419 1.1019 1.0778
irintensity: 6.9807 0.6733 2.0913 1.5987 1.8248 1.4403 7.3088 1.8418 1.0374 2.6150 0.1484 3.2984 6.0287 137.0063 7.2869 45.0326 74.9558 1.4347 13.5694 164.4379 76.1323 0.6102 74.4707 53.6974 0.1155 22.7859 37.5675 13.2631 0.2395 11.7633 76.9868 47.1892 88.8084 179.6292 7.7376 101.0790 21.9157 1.3596 0.1757 0.7526 2.1453 82.5376
temp: 298.150 k
press: 1.00000 atm
elementType: 9 9 9 7 7 6 6 6 6 6 6 1 1 1 1 1
symmnumber: 1
zpe: 279613.0 jmol-1
zpe.correction: 0.106499 hartree
zpe.thermalcorrener: 0.115810 hartree
zpe.thermalcorrenthalpy: 0.116754 hartree
zpe.thermalcorrgfe: 0.072253 hartree
zpe.sumelectzpe: -639.811286 hartree
zpe.sumelectthermal: -639.801975 hartree
zpe.sumelectthermalent: -639.801031 hartree
zpe.sumelectthermalfe: -639.845532 hartree
dipole: -0.5746 0.8871 0.0755
dipole: 1.0596
quadrupole: -65.0750 -60.0470 -61.2893
quadrupole: 8.2264 -0.0133 -0.0568
quadrupole: -2.9379 2.0901 0.8478 8.2264 -0.0133 -0.0568
hfenergy: -639.9177848 hartree
pointgroup: C01 [X(C6H5F3N2)]
dipole: 0.2135916 -0.3519962 0.0654015 debye
dipolederiv: -0.2035194 -0.0854016 -0.0111619 -0.0123599 -0.9155863 0.0306986 -0.0144145 0.0228877 -0.0854705 -0.643248 0.4048239 -0.0714897 0.3618617 -0.5554471 0.0544481 -0.0708796 0.0601246 -0.1396089 -0.6986614 0.3698875 -0.0781867 0.4273525 -0.5072947 0.0614599 -0.0802015 0.053851 -0.1317918 -1.0327727 -0.4861143 -0.0417615 -0.1273009 0.0149678 -0.0143782 -0.0093704 -0.0442687 -0.4852514 -0.5923139 -0.0285169 -0.0730119 0.1623216 0.041091 0.0244964 -0.0908285 -0.009662 -0.0035091 1.2138928 0.5116432 0.1011007 0.3774075 -0.1677744 0.0406981 0.1021611 0.0585106 0.1406257 -0.2048121 -0.0863683 -0.0174241 0.1564094 0.9401244 -0.0207902 -0.0182585 -0.0470815 -0.0331241 0.3864725 -0.4409389 0.0567821 -0.7617968 0.5063823 -0.1015949 0.06092 -0.0687892 0.0106629 0.8612259 -0.2795142 0.0966341 -0.4048228 0.6503624 -0.0638965 0.1011299 -0.0480047 0.1063271 0.1544391 0.0210543 0.0298704 -0.0282 -0.0009438 -0.0078476 0.0320417 -0.0006516 -0.1160888 -0.2490125 -0.0758541 -0.0024322 0.1171308 -0.2744372 0.015379 -0.0097308 -0.0060605 -0.2130329 0.1059869 -0.0129816 -0.0081808 -0.0084664 -0.0249069 0.0057326 -0.0071784 0.0050675 0.1799737 0.0013964 -0.022746 -0.0211689 -0.0280612 0.0912466 0.0003448 -0.020155 0.0004131 0.1952456 0.2694612 -0.0189512 -0.0138544 -0.0905246 0.0738887 -0.0071127 -0.022656 0.0007421 0.3568625 0.2803283 0.1137114 0.16423 -0.0701424 0.0614185 -0.038862 0.1130863 -0.0057916 0.1351579 0.3511369 0.1162667 -0.1099452 -0.0708084 0.0669087 0.0212245 -0.065666 0.0287131 0.0830219 unknown
polarizability: 105.1059396|9.9529682|94.7146238|7.4392283|-0.5096938|38.3674698 unknown
InChI: InChI=1S/C6H5F3N2/c7-3-1-2-4(8)6(11-10)5(3)9/h1-2,11H,10H2
charge 0 multiplicity 1
16 atoms
F  -0.09654 2.216556 -0.078949
F  1.66011 -2.301938 0.276617
F  -2.624841 1.205161 -0.322344
N  2.186701 0.366675 0.245474
N  2.664813 1.6927 0.315832
C  0.860383 -0.036617 0.112076
C  -0.263967 0.818616 -0.044417
C  0.552491 -1.431026 0.122459
C  -1.56722 0.298189 -0.172601
C  -0.730801 -1.961206 -0.00494
C  -1.828742 -1.079349 -0.156424
H  -0.870146 -3.044919 0.015403
H  -2.852814 -1.443277 -0.258771
H  2.89349 -0.360107 0.351078
H  2.308734 2.203442 1.132664
H  2.529349 2.211599 -0.559557
