program: Gaussian 09
title: 000298212
version: EM64L-G09RevD.01
frameworkgroup: C1[X(C10H3F7N2)]
method: RPBEPBE
basis: SDD
operation: Freq
keyword: #p
keyword: freq=noraman
keyword: PBEPBE/SDD
title: #p freq=noraman PBEPBE/SDD
converged: YES YES NO NO
title: Mulliken charges:
elementType: F F F F F F F N N C C C C C C C C C C H H H
charge: -0.178326 -0.144715 -0.143956 -0.141147 -0.169782 -0.143109 -0.143323 -0.415988 -0.507753 0.311683 0.225302 0.002067 0.166367 0.059594 0.046165 0.076202 0.015888 0.065974 0.053126 0.348325 0.308866 0.308540
chargesum: 0.00000
title: Mulliken charges with hydrogens summed into heavy atoms:
elementType: F F F F F F F N N C C C C C C C C C C
charge: -0.178326 -0.144715 -0.143956 -0.141147 -0.169782 -0.143109 -0.143323 -0.067663 0.109653 0.311683 0.225302 0.002067 0.166367 0.059594 0.046165 0.076202 0.015888 0.065974 0.053126
polarizability: 2.28503065e+02 2.57887414e+00 1.38727485e+02 -1.93710562e-02 1.05514957e-02 5.29806586e+01
1716.lowfreq: -9.0222 -0.0007 -0.0005 0.0008 2.0030 6.8231 30.8606 63.1575 75.9535
frequency: 30.8267 63.1548 75.9510 101.4409 138.2408 151.9255 157.0391 166.1822 219.9796 237.0160 258.6761 272.4451 274.0876 293.6903 297.0390 305.1485 315.0394 337.9570 346.5914 387.3578 404.5021 408.7388 431.1287 476.4565 497.2335 554.1251 557.3554 578.3162 599.5432 648.8704 651.6677 700.7209 703.2353 711.1645 742.3068 784.1275 894.9613 976.2412 1005.0693 1044.1233 1117.6789 1169.5139 1184.5260 1254.1069 1267.0750 1351.1488 1370.8246 1384.0574 1424.5905 1447.0235 1473.2198 1491.7245 1531.6794 1586.2072 1627.5089 1648.0691 1674.0034 3429.7011 3557.7648 3562.0906
redmass: 4.5194 10.4117 11.3720 17.2129 7.4427 12.4362 7.3555 11.4460 8.0699 2.9957 18.0618 17.2204 13.5938 1.8110 17.1646 15.5727 13.4746 12.6598 10.1586 7.4403 10.6002 12.1545 16.0649 16.7510 15.8188 5.5576 11.6541 2.3388 1.9411 7.7692 1.8609 7.0449 11.5010 8.9631 6.8663 12.5171 12.6698 11.3486 11.1773 12.4793 9.7602 12.6114 11.5717 5.8500 1.1551 11.4662 12.0421 5.5847 6.3123 4.7008 7.4685 3.0015 4.8789 7.9022 9.8547 8.6157 1.1074 1.0419 1.1027 1.0776
irintensity: 2.8289 0.2074 0.7568 0.0487 0.6751 0.2463 0.4331 4.6568 1.2002 1.7050 0.1853 0.0485 2.3708 6.0430 1.9479 5.6304 0.0630 0.2771 1.3506 0.0125 1.9885 0.3256 0.1539 0.4656 0.4472 14.7376 0.8077 82.6695 89.6782 11.4850 280.3809 16.4040 0.0413 1.4141 38.1729 23.9193 147.1171 4.1994 7.8972 27.7882 57.9821 1.8060 10.0512 11.4254 0.2322 281.8106 154.0606 4.9662 250.4825 125.1109 1.1556 90.7124 56.4943 4.7763 161.9584 97.6683 16.0497 0.1026 4.4687 116.4045
temp: 298.150 k
press: 1.00000 atm
elementType: 9 9 9 9 9 9 9 7 7 6 6 6 6 6 6 6 6 6 6 1 1 1
symmnumber: 1
zpe: 313135.6 jmol-1
zpe.correction: 0.119267 hartree
zpe.thermalcorrener: 0.136148 hartree
zpe.thermalcorrenthalpy: 0.137092 hartree
zpe.thermalcorrgfe: 0.074720 hartree
zpe.sumelectzpe: -1189.830657 hartree
zpe.sumelectthermal: -1189.813775 hartree
zpe.sumelectthermalent: -1189.812831 hartree
zpe.sumelectthermalfe: -1189.875204 hartree
dipole: -4.2469 -0.5148 0.0143
dipole: 4.2781
quadrupole: -104.8835 -119.7961 -99.5276
quadrupole: 0.2560 -0.0752 0.0007
quadrupole: 3.1855 -11.7270 8.5415 0.2560 -0.0752 0.0007
hfenergy: -1189.9499236 hartree
pointgroup: C01 [X(C10H3F7N2)]
dipole: 1.6600858 0.2698942 -0.0645049 debye
dipolederiv: -0.1774728 -0.0799873 0.0071183 -0.1273441 -0.8884157 0.0497692 0.009875 0.0483771 -0.1046569 -0.1612457 0.0462072 -0.000379 0.093561 -0.9121967 0.0444417 -0.0033075 0.0460263 -0.0943935 -0.1560107 0.0409862 -0.0000477 0.2072366 -0.9108154 0.0414436 -0.0099838 0.0472522 -0.0878797 -0.1924185 -0.0839263 0.0083485 -0.2441013 -0.917972 0.0563714 0.0177205 0.0511357 -0.0904301 -0.83315 0.3169773 0.007404 0.4343982 -0.4065755 0.0036765 0.0017243 0.007406 -0.0812354 -0.9641686 0.2960341 0.0117591 0.490779 -0.3342875 -0.001496 0.0002897 0.0048963 -0.0828549 -1.0616752 -0.2796441 0.0485889 -0.4581339 -0.2855992 0.0271276 0.0587409 0.0211115 -0.0810932 -0.9884603 -0.2627618 0.0338249 -0.9794938 -0.1748683 0.0124068 0.0832806 -0.0090934 -0.4693089 -0.1700421 -0.2293166 0.0211029 -0.4583059 -0.3905941 0.0387093 0.0316743 0.0308267 -0.006498 0.518062 0.1857259 -0.026319 0.2125349 -0.1312111 0.0034579 -0.0277978 0.0041227 0.0455049 -0.2075882 0.0486649 0.0039269 -0.1834869 -0.2932972 0.0230457 0.0172331 0.0149833 -0.0042242 -0.6139908 -0.2246493 0.0329578 0.2242482 0.9668551 -0.0642871 0.0043802 -0.0501429 -0.0068658 1.3169666 0.606156 -0.0757588 0.846383 0.0913995 -0.0246779 -0.091114 -0.0171849 0.1347649 0.3020878 -0.0680739 -0.0030423 -0.1109223 1.0261741 -0.0511721 -0.0001867 -0.0525452 0.0873206 -0.1446621 -0.0885178 0.0114918 -0.2756732 1.0080919 -0.0472066 0.0231428 -0.0533989 0.0531617 0.2776618 -0.0423267 -0.0041467 0.3943455 1.0383647 -0.0688252 -0.0299076 -0.0542283 0.083982 0.6753899 -0.4131603 -0.0001604 -0.7459343 0.337194 0.0059184 0.0200363 -0.0045128 -0.0046089 1.0754418 -0.3888835 -0.0102824 -0.4798044 0.4270782 -0.0046073 -0.0050023 -0.0075733 0.0746756 0.9837377 0.4715955 -0.0582925 0.4680863 0.1254436 -0.020267 -0.0577016 -0.0202535 0.04378 0.096702 0.0687961 0.0034817 0.1982329 0.2401392 0.0006925 -0.0033258 0.004921 0.3565863 0.2092189 0.0328968 -0.0784939 0.2373498 0.1797381 -0.1296535 -0.0964609 -0.0834932 0.1351386 0.2156165 0.0472076 0.0669179 0.2560447 0.2053543 0.1051322 0.0566901 0.0713675 0.0991349 unknown
polarizability: 227.936993|6.0254564|138.7938565|-6.0710953|-5.1833082|53.480359 unknown
InChI: InChI=1S/C10H3F7N2/c11-3-1-2(4(12)8(16)7(3)15)6(14)10(19-18)9(17)5(1)13/h19H,18H2
charge 0 multiplicity 1
22 atoms
F  1.170827 2.724504 -0.212394
F  0.969516 -2.842297 0.117316
F  -1.463577 2.828843 -0.132739
F  -1.670146 -2.759718 0.200334
F  3.342301 -1.588963 -0.037332
F  -3.869418 1.51008 0.024105
F  -3.980488 -1.25709 0.188574
N  3.473944 1.338087 -0.209198
N  4.783613 0.815647 -0.214275
C  -0.222638 0.712942 -0.049798
C  -0.286032 -0.743418 0.037558
C  1.056316 1.32121 -0.127009
C  2.284913 0.624429 -0.127529
C  0.953705 -1.451777 0.037254
C  -1.459252 1.438538 -0.051149
C  -1.566799 -1.374694 0.116339
C  2.181787 -0.802676 -0.041799
C  -2.68552 0.786956 0.027328
C  -2.743685 -0.631645 0.111853
H  3.408558 2.354316 -0.269574
H  4.988798 0.243726 -1.040945
H  5.040575 0.356397 0.666581
