program: Gaussian 09
title: 000298257
version: EM64L-G09RevD.01
frameworkgroup: C1[X(C17H22O12)]
method: RPBEPBE
basis: SDD
operation: Freq
keyword: #p
keyword: freq=noraman
keyword: PBEPBE/SDD
title: #p freq=noraman PBEPBE/SDD
converged: YES YES NO NO
title: Mulliken charges:
elementType: O O O O O O O O O O O O C C C C C C C C C C C C C C C C C H H H H H H H H H H H H H H H H H H H H H H
charge: -0.217567 -0.275743 -0.300998 -0.275062 -0.266385 -0.172543 -0.239362 -0.241798 -0.241711 -0.222153 -0.237242 -0.254378 -0.124042 -0.118759 -0.100987 -0.227401 -0.024274 0.214118 -0.391080 0.330351 0.329773 0.326168 0.315848 -0.767474 -0.776828 -0.752848 0.291619 -0.767481 -0.751056 0.275088 0.321611 0.347142 0.322113 0.297778 0.257057 0.254870 0.292248 0.244845 0.251546 0.289261 0.241495 0.258688 0.250909 0.253002 0.261518 0.277436 0.243126 0.244461 0.252737 0.255129 0.247236
chargesum: 0.00000
title: Mulliken charges with hydrogens summed into heavy atoms:
elementType: O O O O O O O O O O O O C C C C C C C C C C C C C C C C C
charge: -0.217567 -0.275743 -0.300998 -0.275062 -0.266385 -0.172543 -0.239362 -0.241798 -0.241711 -0.222153 -0.237242 -0.254378 0.151046 0.202852 0.246154 0.094712 0.273504 0.214118 0.120847 0.330351 0.329773 0.326168 0.315848 0.021164 0.012617 0.012581 0.291619 -0.002459 0.004046
polarizability: 2.34420392e+02 -1.27960647e+01 2.29900787e+02 -2.79457725e+00 -1.63272983e+00 1.98196612e+02
1716.lowfreq: -5.7590 0.0003 0.0006 0.0008 1.5946 4.4874 18.8043 21.0358 23.9722
frequency: 18.7292 20.9747 23.9551 29.8744 32.3643 34.1140 41.7103 47.0735 50.8867 57.7716 61.8454 65.6760 70.1945 79.1470 87.1632 89.4917 94.9661 105.3001 111.3854 116.5964 124.7497 133.6906 149.2431 175.0372 188.4721 193.3133 204.4877 207.7844 244.6796 261.9240 282.7619 293.6187 304.6920 311.0732 333.6240 384.2477 406.2681 420.3907 432.7371 466.1441 470.5254 506.5759 532.9548 553.5438 559.9319 560.6200 563.9902 570.5540 589.5484 595.9344 606.7419 620.0152 641.1099 652.5608 660.0200 688.0032 737.9699 765.5840 795.0658 812.5400 838.1172 850.0068 866.6324 892.6505 914.7029 945.8158 952.6180 960.3009 962.3425 968.9905 989.7723 991.4055 993.9708 998.4936 1008.4268 1016.3946 1043.4763 1043.8319 1044.7221 1048.1081 1049.4347 1055.2472 1059.9795 1099.2051 1121.2447 1165.4167 1174.2226 1174.9556 1188.6984 1191.7653 1209.2291 1219.1121 1250.6992 1262.5667 1263.1206 1277.0279 1290.0033 1296.4413 1319.1603 1324.2546 1335.3705 1373.5666 1383.5271 1384.6729 1386.4982 1386.8335 1388.9300 1389.2233 1439.6452 1451.8715 1451.9465 1452.0556 1452.1572 1452.8989 1454.3909 1454.4594 1454.7115 1456.8068 1458.8045 1645.4997 1656.8194 1661.3039 1671.3107 1679.7726 1719.9978 3003.6162 3004.8566 3007.9410 3008.0142 3010.2517 3028.3129 3029.9288 3049.7589 3074.5152 3081.1871 3089.2561 3097.3889 3098.8211 3100.6554 3101.3289 3101.7723 3129.2699 3143.5572 3143.6006 3143.9672 3144.4448 3146.0186
redmass: 6.5599 6.6365 5.5801 1.9076 3.8128 2.7672 5.0032 2.3389 2.4356 7.4064 3.6121 2.9915 4.6503 3.6523 3.0253 4.4559 3.6505 1.0561 6.1847 1.0471 4.7761 1.2423 4.9254 5.8755 8.6854 7.6968 5.8921 7.1512 8.7218 7.4355 4.7804 4.8641 3.8605 5.1865 3.8731 3.5650 3.8504 4.0377 3.0212 4.6639 4.6308 4.0193 4.0649 3.3180 3.2749 3.4520 3.4094 3.2552 5.0635 5.6985 5.9399 4.8706 5.1554 5.9992 7.4882 5.6134 5.1526 3.5947 6.7125 4.9176 6.4032 5.0956 5.6111 6.5921 4.8085 5.9225 4.7240 5.5731 3.8590 3.7554 2.3117 2.2338 1.8857 2.1152 2.1943 2.8261 1.8050 1.6524 1.6658 2.3892 1.6529 1.6811 2.7077 4.3947 3.0137 2.9067 3.0226 2.7996 3.0941 3.1905 3.4484 1.4979 1.2950 1.2078 1.2505 1.2303 1.2372 1.5397 1.2975 1.4186 1.3584 1.4071 1.2642 1.3182 1.2391 1.2657 1.3552 1.2329 1.0960 1.0535 1.0528 1.0548 1.0558 1.0520 1.0544 1.0577 1.0517 1.0537 1.0531 8.8957 9.8272 10.0024 9.6449 10.1729 12.5514 1.0391 1.0380 1.0372 1.0376 1.0376 1.0845 1.0855 1.0579 1.0847 1.0856 1.0872 1.0952 1.0934 1.0943 1.0958 1.0972 1.1077 1.1021 1.1019 1.1023 1.1013 1.1018
irintensity: 0.2917 0.4329 0.4339 0.5122 0.6652 0.0561 0.1206 1.4104 1.5384 0.5278 2.7231 0.7125 10.7078 1.1636 6.3139 2.7450 4.4088 0.2986 4.5381 0.3476 3.4919 0.7429 1.2994 5.9040 0.2235 5.0476 6.1876 4.3937 1.2318 4.9242 4.4015 4.5266 12.4575 24.4023 20.4869 10.2484 17.9066 1.8571 6.7827 9.2705 1.4951 5.7728 10.0206 3.6898 4.1541 8.4065 3.2685 5.0145 10.0561 11.2105 0.1100 18.0671 3.4590 47.8599 1.9895 6.8668 5.5333 14.0423 2.6713 0.3763 68.5161 56.2153 44.4631 60.2162 32.9191 45.9051 88.0637 128.6765 23.2062 35.1197 127.5344 15.9439 70.8703 131.8847 63.3050 97.1985 31.0870 14.6551 20.8262 51.5493 11.3705 1.5491 80.4751 147.9983 38.0801 107.8515 289.0131 12.2044 488.9176 218.0579 278.0923 7.9946 15.8694 8.8491 37.4510 4.8959 7.7694 3.4576 3.7931 0.5058 9.2840 2.5102 83.9981 19.8495 72.2960 47.8855 36.0285 63.5829 28.3425 16.1037 10.8678 15.5045 35.2405 17.0688 10.6437 22.0073 24.9857 14.2605 23.9618 150.8416 36.6224 150.8291 263.7887 187.3655 298.0192 1.8158 1.4765 4.6294 0.6000 0.5567 4.3768 16.7176 16.8131 5.2533 21.5258 10.0848 5.8617 3.2336 7.3674 4.7474 0.9699 1.9536 8.1044 5.9976 3.8838 11.5490 7.1259
temp: 298.150 k
press: 1.00000 atm
elementType: 8 8 8 8 8 8 8 8 8 8 8 8 6 6 6 6 6 6 6 6 6 6 6 6 6 6 6 6 6 1 1 1 1 1 1 1 1 1 1 1 1 1 1 1 1 1 1 1 1 1 1
symmnumber: 1
zpe: 1000951.7 jmol-1
zpe.correction: 0.381242 hartree
zpe.thermalcorrener: 0.414088 hartree
zpe.thermalcorrenthalpy: 0.415032 hartree
zpe.thermalcorrgfe: 0.310370 hartree
zpe.sumelectzpe: -1561.500085 hartree
zpe.sumelectthermal: -1561.467239 hartree
zpe.sumelectthermalent: -1561.466295 hartree
zpe.sumelectthermalfe: -1561.570958 hartree
dipole: -1.8796 -0.3874 -4.8362
dipole: 5.2031
quadrupole: -163.8839 -171.1152 -161.7503
quadrupole: 5.0642 -1.4858 8.0870
quadrupole: 1.6992 -5.5320 3.8328 5.0642 -1.4858 8.0870
hfenergy: -1561.8813275 hartree
pointgroup: C01 [X(C17H22O12)]
dipole: -0.8359971 1.3677222 1.2731291 debye
polarizability: 228.421423|11.7280479|215.0243567|-6.2933966|-18.4247668|219.0720115 unknown
InChI: InChI=1S/C17H22O12/c1-7(18)24-6-12(25-8(2)19)13(26-9(3)20)14-15(27-10(4)21)16(17(23)29-14)28-11(5)22/h12-16H,6H2,1-5H3
charge 0 multiplicity 1
51 atoms
O  0.672778 0.852524 -1.679759
O  1.972824 -1.455468 -0.203443
O  -0.619976 -0.824237 1.385774
O  3.153829 2.052792 -0.076206
O  -2.157568 0.767194 -1.644673
O  2.450198 1.362963 -3.090312
O  -4.022644 1.166947 0.836077
O  2.464827 -2.085452 1.995586
O  -1.037536 -3.065622 0.873322
O  5.419175 1.471474 0.046835
O  -2.175189 -1.317281 -2.687814
O  -3.83975 -0.510858 2.448449
C  0.501128 0.52578 -0.224311
C  1.880587 -0.036446 0.205152
C  -0.664797 -0.456911 -0.054864
C  2.859079 0.735713 -0.691789
C  -2.092417 0.104619 -0.318751
C  2.047274 1.024341 -1.972344
C  -2.54064 1.162961 0.696624
C  2.27074 -2.409108 0.806524
C  -0.909387 -2.170325 1.732283
C  4.52029 2.311444 0.231841
C  -2.148829 -0.071219 -2.77728
C  2.26728 -3.794609 0.216592
C  -1.03376 -2.293685 3.226107
C  4.661178 3.71269 0.77136
C  -4.553826 0.254509 1.760186
C  -2.075943 0.756931 -4.03429
C  -6.062307 0.329436 1.77176
H  0.318703 1.478816 0.305563
H  2.079509 0.061872 1.284021
H  -0.507682 -1.353244 -0.678681
H  3.797159 0.194333 -0.895594
H  -2.779464 -0.762688 -0.316385
H  -2.088542 0.961289 1.681467
H  -2.302343 2.175024 0.336682
H  1.218143 -4.130117 0.115982
H  2.801564 -4.486292 0.884103
H  2.718642 -3.796546 -0.787893
H  -1.945846 -1.756679 3.543095
H  -1.108091 -3.353219 3.509335
H  -0.16559 -1.82862 3.721852
H  3.868314 3.931293 1.504694
H  5.652671 3.834105 1.230497
H  4.55655 4.436248 -0.057001
H  -1.043736 1.138222 -4.141875
H  -2.326309 0.137241 -4.907389
H  -2.748323 1.627789 -3.9716
H  -6.403539 1.370051 1.655407
H  -6.464995 -0.251607 0.921987
H  -6.449115 -0.102963 2.706195
