program: Gaussian 09
title: 000298231
version: EM64L-G09RevD.01
frameworkgroup: C1[X(C15H20O11)]
method: RPBEPBE
basis: SDD
operation: Freq
keyword: #p
keyword: freq=noraman
keyword: PBEPBE/SDD
title: #p freq=noraman PBEPBE/SDD
converged: YES YES NO NO
title: Mulliken charges:
elementType: O O O O O O O O O O O C C C C C C C C C C C C C C C H H H H H H H H H H H H H H H H H H H H
charge: -0.206973 -0.263387 -0.271500 -0.258837 -0.269871 -0.277545 -0.229603 -0.187329 -0.252038 -0.232216 -0.233414 -0.122752 -0.259033 -0.059086 -0.153884 -0.125893 0.240819 0.188310 0.327792 0.324339 0.329159 -0.759025 -0.501033 -0.772008 -0.497515 -0.755013 0.318398 0.303763 0.327751 0.301299 0.291890 0.249778 0.249761 0.246663 0.251645 0.243309 0.248583 0.275085 0.245502 0.247447 0.257246 0.243256 0.229649 0.243204 0.248948 0.254360
chargesum: 0.00000
title: Mulliken charges with hydrogens summed into heavy atoms:
elementType: O O O O O O O O O O O C C C C C C C C C C C C C C C
charge: -0.206973 -0.263387 -0.271500 -0.258837 -0.269871 -0.277545 -0.229603 -0.187329 -0.252038 -0.232216 -0.233414 0.195646 0.044731 0.268665 0.147414 0.165997 0.240819 0.188310 0.327792 0.324339 0.329159 -0.012823 0.242505 -0.003974 0.232636 -0.008501
polarizability: 2.21372799e+02 1.93995196e+00 1.92928334e+02 3.93294965e-01 1.20018536e+01 1.72626989e+02
1716.lowfreq: -11.4398 -4.1082 0.0004 0.0006 0.0009 1.7963 9.3188 17.8041 19.4129
frequency: -8.2200 17.4535 19.3496 33.1709 36.6065 38.9928 50.2151 51.9943 61.2819 68.7588 72.3906 74.3475 86.9224 89.3090 98.6636 106.4116 111.4718 127.4890 133.1018 150.2336 174.9747 176.5621 202.7145 203.3513 219.2068 222.0167 242.3117 272.0924 276.0363 283.1710 323.8335 338.7679 386.7177 402.7787 416.6134 468.7701 473.9685 496.7221 543.6612 558.7861 559.9287 565.7968 578.2250 591.1913 597.0568 618.2178 646.1828 662.0883 710.6214 736.6314 772.5620 783.0029 828.1720 830.9571 852.6792 876.7643 887.7086 894.7358 942.4082 955.6534 963.2370 982.5424 993.8704 996.4099 1009.9570 1013.1394 1020.5058 1040.2150 1042.2766 1047.1064 1056.1764 1088.5004 1114.9461 1116.5926 1142.0947 1149.2872 1152.9413 1153.3907 1180.1317 1183.5350 1193.5761 1211.0154 1238.3425 1246.2478 1287.4075 1305.1738 1305.3880 1322.3724 1330.9447 1338.6704 1363.0022 1379.2468 1380.7527 1383.9109 1386.3379 1421.9553 1422.8259 1448.2290 1452.4144 1453.6572 1453.7706 1454.1017 1454.7382 1454.8916 1457.4034 1462.5929 1465.4780 1639.5552 1655.5828 1668.5412 1672.0228 1681.1565 3004.7450 3006.8549 3007.0864 3007.7383 3011.6393 3021.6800 3034.7604 3038.7485 3071.8717 3083.9024 3097.3270 3097.6908 3099.4694 3112.6867 3117.2586 3142.3978 3143.4126 3143.8541 3151.0803 3160.7017
redmass: 1.2216 6.7144 5.8440 4.0141 1.7131 3.5456 4.4258 5.3166 3.2601 2.2927 3.3831 3.8408 5.5893 1.8615 1.6111 2.2785 1.8309 1.3323 2.1413 5.9644 5.6445 4.6713 6.3672 7.0209 5.3009 8.0675 5.8976 7.7463 4.3819 4.7617 6.8702 7.6723 5.2715 3.8737 4.1898 5.0929 4.5355 7.2704 3.9540 3.5313 3.2877 4.4177 6.0589 5.6810 5.7150 5.7172 4.9992 5.4255 6.2037 5.3027 5.5221 5.5238 6.5243 6.3059 4.1404 7.1808 6.9604 6.8169 6.3820 5.0527 3.8492 2.2570 1.9788 2.5146 3.9873 3.8755 4.1590 1.6675 1.6738 1.6748 4.9523 2.2918 1.2826 1.2666 3.5631 2.2932 1.6179 1.4784 3.1628 3.8928 3.9268 3.8465 1.5523 1.2608 1.2691 1.2636 1.5211 1.3067 1.4553 1.4207 1.3052 1.3395 1.2502 1.2500 1.3206 1.1778 1.1836 1.0591 1.0513 1.0494 1.0536 1.0560 1.0504 1.0498 1.0536 1.0508 1.0508 10.2529 9.5809 10.1053 9.6676 10.8251 1.0379 1.0376 1.0291 1.0371 1.0292 1.0823 1.0827 1.0825 1.0860 1.0881 1.0959 1.0963 1.0948 1.1051 1.1051 1.1020 1.1014 1.1015 1.1052 1.1055
irintensity: 1.3149 2.6283 0.7058 0.5228 1.7170 1.4158 0.8578 0.3236 0.4488 0.6139 2.0706 3.1731 5.9254 0.0587 0.0700 1.1543 0.2057 0.4358 1.2586 3.9010 7.4882 5.3929 5.0622 4.9324 6.7684 0.3864 2.6635 4.3350 12.9990 20.6923 1.8477 7.2494 5.4789 16.9578 6.5661 18.9598 3.5299 34.6852 6.7234 9.1571 7.0212 5.0562 1.3126 20.6379 6.7483 8.5700 2.1012 16.6787 1.4137 15.9474 7.3231 21.0885 56.6423 12.8294 43.7613 228.2576 14.0385 57.0008 6.8962 51.6746 174.5233 53.3432 22.9028 61.7487 12.3101 95.8286 279.6205 7.9274 17.1973 6.5758 77.4705 47.4283 3.0327 0.5701 238.4330 112.3052 14.2523 9.0153 154.9727 227.9439 261.2854 348.4969 12.6600 15.2171 12.0802 12.5025 41.4866 26.6363 17.0632 3.3393 4.0261 29.8416 5.0009 70.4368 79.6959 25.5484 14.8100 15.5393 32.9799 6.6011 14.8480 13.8984 26.1306 20.5651 16.9123 10.6222 10.3778 209.6487 209.0041 161.9510 175.4021 184.5423 1.4175 2.4915 37.2022 1.5741 25.8200 10.1316 2.3994 9.4508 3.5157 5.8868 7.0536 8.2627 4.9456 19.4368 18.5589 9.0002 11.2021 8.9519 14.7337 7.8114
temp: 298.150 k
press: 1.00000 atm
elementType: 8 8 8 8 8 8 8 8 8 8 8 6 6 6 6 6 6 6 6 6 6 6 6 6 6 6 1 1 1 1 1 1 1 1 1 1 1 1 1 1 1 1 1 1 1 1
symmnumber: 1
zpe: 905542.4 jmol-1
zpe.correction: 0.344903 hartree
zpe.thermalcorrener: 0.373613 hartree
zpe.thermalcorrenthalpy: 0.374558 hartree
zpe.thermalcorrgfe: 0.280930 hartree
zpe.sumelectzpe: -1409.057555 hartree
zpe.sumelectthermal: -1409.028844 hartree
zpe.sumelectthermalent: -1409.027900 hartree
zpe.sumelectthermalfe: -1409.121528 hartree
dipole: -0.8749 0.7406 4.9082
dipole: 5.0403
quadrupole: -142.6778 -142.0640 -153.8418
quadrupole: -10.7374 4.0056 17.1942
quadrupole: 3.5167 4.1305 -7.6472 -10.7374 4.0056 17.1942
hfenergy: -1409.4024578 hartree
pointgroup: C01 [X(C15H20O11)]
dipole: -0.2453532 0.0395628 1.9673659 debye
polarizability: 220.4917919|-5.785587|189.4214611|2.2292715|14.4047097|177.0148694 unknown
InChI: InChI=1S/C15H20O11/c1-6(16)23-10-9(13(19)21-4)11(14(20)22-5)26-15(25-8(3)18)12(10)24-7(2)17/h9-12,15H,1-5H3
charge 0 multiplicity 1
46 atoms
O  1.168378 0.78059 -1.163207
O  -0.660707 -0.111613 1.820345
O  -2.427531 0.191816 -0.417767
O  -0.482549 2.163268 -0.132687
O  0.492937 -2.790763 -1.135501
O  3.760018 -0.134689 1.22355
O  2.748254 -2.508996 -0.639052
O  3.916975 0.524467 -1.014267
O  -2.677485 -1.215172 2.256998
O  -3.125011 -1.785516 -1.455046
O  -1.331273 3.507818 -1.856585
C  -0.450413 -0.922328 0.586845
C  1.084173 -1.085337 0.484782
C  -1.026899 -0.201175 -0.652176
C  1.711513 0.294391 0.11832
C  -0.249551 1.05269 -1.088625
C  1.552635 -2.18179 -0.475723
C  3.234854 0.24898 -0.013833
C  -1.839424 -0.335475 2.550001
C  -3.409206 -0.745416 -0.82793
C  -0.997487 3.369899 -0.663652
C  -1.91916 0.636195 3.70474
C  0.845107 -3.871535 -2.093414
C  -4.771954 -0.295822 -0.369852
C  5.223501 -0.374889 1.239542
C  -1.062645 4.41675 0.423666
H  -0.961858 -1.891979 0.70827
H  1.474325 -1.357851 1.483222
H  -0.987998 -0.931481 -1.481737
H  1.4454 1.002032 0.926912
H  -0.548304 1.38617 -2.095673
H  -0.951271 0.70182 4.227985
H  -2.15405 1.643582 3.315914
H  -2.710109 0.323477 4.401466
H  1.511245 -3.473499 -2.8762
H  1.351392 -4.694124 -1.562145
H  -0.118258 -4.194779 -2.509668
H  -4.876927 -0.555518 0.699799
H  -5.552313 -0.816412 -0.943845
H  -4.880923 0.795889 -0.468633
H  5.462935 -1.205437 0.554931
H  5.764551 0.532912 0.924754
H  5.455319 -0.63692 2.281158
H  -1.528956 4.000075 1.331777
H  -1.630149 5.288455 0.067632
H  -0.0392 4.734241 0.692409
