program: Gaussian 09
title: 000298245
version: EM64L-G09RevD.01
frameworkgroup: C1[X(C16H24O10)]
method: RPBEPBE
basis: SDD
operation: Freq
keyword: #p
keyword: freq=noraman
keyword: PBEPBE/SDD
title: #p freq=noraman PBEPBE/SDD
converged: YES YES NO NO
title: Mulliken charges:
elementType: O O O O O O O O O O C C C C C C C C C C C C C C C C H H H H H H H H H H H H H H H H H H H H H H H H
charge: -0.254892 -0.263235 -0.269143 -0.276378 -0.259192 -0.248530 -0.239589 -0.250938 -0.229944 -0.252520 -0.144324 -0.091772 -0.082498 0.020252 -0.104707 -0.404456 -0.203073 0.335252 0.317133 0.301374 -0.681831 -0.765744 -0.780944 0.293453 -0.756764 -0.748242 0.305345 0.295944 0.291657 0.270936 0.231624 0.261634 0.267594 0.225116 0.193994 0.207311 0.226880 0.229530 0.252169 0.245029 0.253863 0.239748 0.250082 0.290307 0.252079 0.255594 0.248927 0.248041 0.252201 0.245647
chargesum: 0.00000
title: Mulliken charges with hydrogens summed into heavy atoms:
elementType: O O O O O O O O O O C C C C C C C C C C C C C C C C
charge: -0.254892 -0.263235 -0.269143 -0.276378 -0.259192 -0.248530 -0.239589 -0.250938 -0.229944 -0.252520 0.161022 0.204172 0.209159 0.291188 0.126916 0.124772 0.216037 0.335252 0.317133 0.301374 -0.018110 -0.014682 -0.000806 0.293453 -0.000164 -0.002353
polarizability: 2.16002167e+02 -2.02263396e+00 2.08891876e+02 -1.35876540e+01 4.49357529e+00 1.89901349e+02
1716.lowfreq: -6.6800 -0.0007 -0.0002 0.0006 0.9822 4.9535 8.4467 17.4188 21.5144
frequency: 1.5441 17.2796 21.4762 24.5451 25.6753 35.8366 38.3775 44.1578 50.6625 61.1764 64.2443 66.5554 72.2286 76.0877 80.8036 90.3359 102.0036 132.4601 145.2784 147.6519 177.7610 183.6879 204.0622 208.7528 229.5813 244.1742 253.4099 272.4140 287.6851 292.9673 318.5935 332.6522 361.5415 377.9133 412.0511 430.9863 464.3017 498.3598 504.1294 514.1920 553.7332 561.8708 563.4527 569.8545 589.7499 597.7431 617.0014 623.6717 635.4262 656.2899 753.6579 780.0988 805.9700 813.4437 823.0974 843.5461 856.9431 868.3619 903.1656 918.6162 946.7855 963.4728 969.3146 981.9412 994.3121 996.7054 1001.9497 1009.3428 1011.9891 1029.4548 1042.7150 1043.2139 1043.4745 1047.1930 1053.6050 1059.0688 1091.9780 1109.5374 1129.1616 1139.3230 1163.6543 1182.8928 1185.3220 1195.3688 1209.3159 1240.4731 1249.9906 1254.2868 1262.7451 1272.6910 1290.7999 1298.4889 1306.6953 1328.8095 1350.5015 1359.6351 1371.7953 1380.6609 1381.2852 1383.8606 1385.2325 1387.3854 1388.6597 1399.6995 1444.6719 1452.4341 1452.4632 1453.1422 1453.8022 1454.1863 1454.7111 1455.1408 1460.9208 1460.9787 1479.8955 1493.4750 1649.1873 1656.8544 1661.9398 1669.5678 2951.0473 2994.5487 2998.7468 3005.1784 3006.9415 3008.4839 3009.3234 3020.6218 3026.2252 3038.4699 3045.6405 3056.0675 3071.5233 3091.8169 3098.3886 3099.5376 3099.9815 3100.1773 3101.9322 3130.7086 3142.1400 3143.2517 3144.1609 3144.4044
redmass: 1.4219 3.0406 1.3286 3.7390 3.1394 6.6364 5.3696 4.0366 5.5294 2.4977 2.4243 2.3515 3.5168 3.8992 1.4507 3.7009 3.7814 5.1838 2.7022 1.2621 4.9427 8.6281 6.5844 5.9393 3.4531 1.4325 5.6048 5.0385 4.9229 5.4426 2.6541 3.9370 4.2907 3.7981 3.6411 3.1638 4.3111 4.9275 4.0262 4.1578 3.3081 3.3003 3.3704 3.3248 5.5225 5.5032 5.1069 5.1167 4.9174 4.6940 4.1512 4.8416 2.6040 1.4646 3.7778 4.0676 4.9984 4.4211 4.9315 4.5035 4.1801 3.9882 3.9219 3.3515 2.0331 2.3288 2.3825 2.3785 2.9471 3.5083 1.7206 1.6586 1.6525 3.2720 1.6522 3.3216 3.4925 2.1788 2.0619 1.4833 2.3731 3.4051 3.2200 3.2340 3.3807 1.3768 1.1512 1.2499 1.2740 1.2158 1.3590 1.1517 1.4641 1.2323 1.4165 1.4176 1.2809 1.3632 1.2842 1.2481 1.2829 1.2466 1.4017 1.3082 1.0958 1.0586 1.0554 1.0556 1.0512 1.0509 1.0494 1.0532 1.0559 1.0420 1.0489 1.0813 9.0063 9.4687 9.9348 9.8551 1.0615 1.0365 1.0848 1.0370 1.0377 1.0381 1.0370 1.0843 1.1011 1.0838 1.0850 1.0581 1.0850 1.0989 1.0968 1.0952 1.0960 1.0949 1.1012 1.1076 1.1018 1.1020 1.1020 1.1012
irintensity: 1.6322 0.2775 0.9422 0.1343 0.2749 0.9557 0.2279 0.1967 0.4561 2.5798 1.8542 4.5457 0.1644 2.4737 0.2959 11.6445 0.7998 0.7906 5.5423 0.8788 3.9967 0.4500 10.2793 5.3314 2.5916 1.3396 4.6517 0.2931 5.6575 4.0645 10.3582 13.4781 5.8627 20.2078 6.1559 20.4998 3.4090 28.0725 12.3624 5.2907 3.6933 4.4766 1.6721 6.0724 16.1746 5.6175 7.3149 13.8493 1.7920 1.0408 7.0875 21.3239 6.9719 6.5253 33.3014 5.2608 49.8085 18.4601 65.6033 174.2451 25.4704 35.1177 32.4668 86.4121 80.4449 145.4237 92.1141 109.9693 56.5968 65.8159 13.8121 12.3098 12.6528 138.4604 9.8215 62.6417 15.5840 8.5333 28.4070 3.4647 66.9966 264.6966 284.3856 249.5354 333.9920 16.4583 1.3602 43.0269 17.1608 2.6516 3.2676 10.6034 18.5991 7.3437 2.1761 0.4289 5.3894 19.6688 14.4992 41.6665 100.4694 51.7330 22.4227 20.5890 24.9601 27.2914 23.0346 26.8680 19.5770 15.0425 12.5551 12.0577 24.6569 9.1862 6.3293 4.8431 197.0015 158.9798 97.0883 247.8149 55.1727 24.0154 42.7958 4.8173 1.7814 1.0251 2.1385 6.0194 23.8264 5.0985 19.4470 11.7960 5.1270 33.8540 7.7053 6.7838 2.3095 6.3988 38.2317 0.6629 9.6464 8.8905 8.8996 8.8270
temp: 298.150 k
press: 1.00000 atm
elementType: 8 8 8 8 8 8 8 8 8 8 6 6 6 6 6 6 6 6 6 6 6 6 6 6 6 6 1 1 1 1 1 1 1 1 1 1 1 1 1 1 1 1 1 1 1 1 1 1 1 1
symmnumber: 1
zpe: 1027477.2 jmol-1
zpe.correction: 0.391345 hartree
zpe.thermalcorrener: 0.421707 hartree
zpe.thermalcorrenthalpy: 0.422652 hartree
zpe.thermalcorrgfe: 0.320687 hartree
zpe.sumelectzpe: -1374.313553 hartree
zpe.sumelectthermal: -1374.283191 hartree
zpe.sumelectthermalent: -1374.282247 hartree
zpe.sumelectthermalfe: -1374.384212 hartree
dipole: -1.7916 4.2255 -0.0943
dipole: 4.5906
quadrupole: -146.7865 -149.2375 -148.9123
quadrupole: -4.0408 -17.7502 1.4918
quadrupole: 1.5256 -0.9254 -0.6002 -4.0408 -17.7502 1.4918
hfenergy: -1374.7048985 hartree
pointgroup: C01 [X(C16H24O10)]
dipole: -1.3927854 1.1117476 -0.2934866 debye
polarizability: 204.9295852|-10.4306176|202.6618785|-15.9004473|-4.9196416|207.2039281 unknown
InChI: InChI=1S/C16H24O10/c1-6-21-16-15(25-11(5)20)14(24-10(4)19)13(23-9(3)18)12(26-16)7-22-8(2)17/h12-16H,6-7H2,1-5H3
charge 0 multiplicity 1
50 atoms
O  -0.957602 0.349993 -1.659195
O  1.215518 1.025892 1.149379
O  0.126999 -1.476078 1.433681
O  1.961573 -0.07343 -2.319625
O  -0.208382 2.564701 -1.033937
O  -3.517748 -0.528696 0.238124
O  2.87705 -0.051841 2.402279
O  -0.076577 -3.654389 0.611695
O  4.101584 0.85128 -2.115053
O  -3.132732 -1.680442 2.236187
C  1.399905 0.049289 0.048157
C  0.220251 -0.938739 0.059277
C  1.461225 0.855378 -1.266316
C  -1.103099 -0.223789 -0.293199
C  0.096545 1.360971 -1.77308
C  -2.3132 -1.163888 -0.367539
C  -1.393422 3.288864 -1.559569
C  1.997077 0.827279 2.307663
C  -0.040792 -2.869683 1.584584
C  3.335872 0.018209 -2.640863
C  -1.57899 4.531154 -0.692356
C  1.590115 1.823715 3.367334
C  -0.201742 -3.210651 3.042075
C  -3.81247 -0.871661 1.564846
C  3.694981 -1.030754 -3.66637
C  -5.042854 -0.127132 2.033961
H  2.353136 -0.485033 0.21413
H  0.41094 -1.75806 -0.659312
H  2.163237 1.69901 -1.151668
H  -1.276255 0.58976 0.437383
H  0.143373 1.549948 -2.86465
H  -2.581662 -1.328965 -1.421948
H  -2.126691 -2.124203 0.137579
H  -2.276047 2.621721 -1.518812
H  -1.205984 3.558653 -2.621384
H  -2.448452 5.116377 -1.043422
H  -1.750571 4.246368 0.360051
H  -0.683275 5.174319 -0.734519
H  0.644245 1.491453 3.832544
H  2.36822 1.88318 4.142156
H  1.412051 2.814546 2.919732
H  -0.086046 -4.294235 3.188797
H  0.528569 -2.657772 3.654731
H  -1.216512 -2.902098 3.353386
H  2.907545 -1.115208 -4.432185
H  3.782721 -2.014791 -3.170836
H  4.66019 -0.780836 -4.130212
H  -4.829882 0.955338 2.08523
H  -5.869653 -0.264792 1.317235
H  -5.340085 -0.489231 3.028454
