program: Gaussian 09
title: 000298889
version: EM64L-G09RevD.01
frameworkgroup: C1[X(C17H16O)]
method: RPBEPBE
basis: SDD
operation: Freq
keyword: #pfreq=noraman
keyword: PBEPBE/SDD
title: #p freq=noraman PBEPBE/SDD
converged: YES YES NO NO
title: Mulliken charges:
elementType: O C C C C C C C C C C C C C C C C C H H H H H H H H H H H H H H H H
charge: -0.243863 -0.364987 -0.335640 -0.518536 0.578730 0.135482 0.316024 -0.435780 -0.415540 -0.230532 -0.245340 -0.346713 -0.354429 -0.246301 -0.413230 -0.374431 0.438611 -0.806109 0.276476 0.253128 0.276492 0.247689 0.234810 0.226237 0.226604 0.224319 0.227050 0.276764 0.229314 0.232992 0.233713 0.229788 0.227189 0.240020
chargesum: 0.00000
title: Mulliken charges with hydrogens summed into heavy atoms:
elementType: O C C C C C C C C C C C C C C C C C
charge: -0.243863 -0.088512 -0.082512 0.005645 0.578730 0.135482 0.316024 -0.200970 -0.189302 -0.003928 -0.021021 -0.119663 -0.077665 -0.016987 -0.180237 -0.140718 0.438611 -0.109112
polarizability: 2.66953489e+02 -1.04232064e+01 1.78294778e+02 -3.47653543e+00 1.07176508e+01 1.35164156e+02
1716.lowfreq: -36.8120 -10.9810 -0.0007 0.0004 0.0005 0.9771 4.1089 14.1327 27.9307
frequency: -36.4593 13.5170 27.7144 36.0047 65.4115 101.6586 125.8492 151.3502 195.7801 246.1751 269.8930 302.2466 332.2391 346.1384 383.9549 403.5322 404.4155 449.8878 487.3917 526.7375 554.5672 589.7378 616.0024 633.8897 678.5208 701.8732 724.0299 734.4168 758.0162 766.6131 793.5983 801.4138 843.4374 847.5132 862.6656 878.2097 909.8063 944.5296 964.5144 972.8461 981.8028 987.8577 992.3983 993.0093 999.1340 1012.4898 1030.0804 1039.2345 1046.9250 1065.8040 1079.3145 1088.2173 1120.4174 1126.2660 1171.9654 1180.1652 1191.5884 1196.7329 1222.7174 1234.9747 1237.9981 1305.3155 1317.6026 1345.5368 1370.5887 1382.3921 1395.6056 1400.2477 1413.4473 1429.3941 1449.6184 1467.7516 1471.6363 1490.6267 1503.6632 1543.1717 1584.2504 1589.7365 1615.3879 1619.9797 2976.5675 3057.9838 3088.3115 3098.7106 3115.0739 3119.8157 3124.0652 3125.8580 3127.6224 3133.6963 3144.3983 3151.0377 3159.2302 3162.9062 3163.1537 3211.0017
redmass: 1.0176 4.3670 3.8014 4.1368 4.4898 5.4164 4.5690 3.8652 4.3584 4.4714 4.0214 4.8084 3.2499 3.9960 3.6437 2.8113 2.8176 4.3808 3.0541 2.9544 3.8138 5.0801 6.4283 6.9143 4.3264 1.7843 2.8509 3.2111 2.0486 3.1118 2.4658 3.9332 1.6177 1.3072 1.3863 3.3963 1.4443 1.8956 1.3747 1.4052 1.8514 2.9073 2.5625 1.3186 1.3962 2.5757 2.0422 1.9691 1.5926 1.2386 1.3203 1.3964 1.3389 1.3248 1.0948 1.8973 1.1200 1.2732 3.6580 1.7792 1.7234 1.4217 1.5405 1.6003 4.2842 5.2621 1.2291 2.5569 2.8364 1.3653 2.0480 1.0960 1.0682 2.5086 2.6285 6.9342 6.5983 5.9790 6.0682 6.3333 1.0386 1.0949 1.0998 1.0556 1.0863 1.0870 1.0886 1.0890 1.0896 1.0909 1.0960 1.0947 1.0940 1.0915 1.1014 1.1157
irintensity: 0.5034 0.7297 0.1363 0.1501 1.1018 1.1566 1.1522 1.1592 0.7839 5.1928 6.3843 0.9720 0.5079 4.3244 5.2175 0.0626 0.2754 5.3676 11.5131 14.1962 3.8231 5.0558 0.2723 1.0790 21.0851 41.6151 24.0794 1.3654 61.0791 7.7754 27.6060 4.7493 13.9066 0.7878 16.3427 2.0205 4.0854 22.7555 1.0414 1.4758 23.8967 5.9045 21.4021 0.2053 3.8247 5.5517 20.5312 70.6224 20.5988 7.9442 2.4385 20.1864 2.7765 15.7030 0.2140 9.1403 0.2818 57.7388 37.9521 72.3602 80.0166 28.1827 8.6757 105.8858 2.1789 51.1948 11.5509 67.3930 71.9342 21.8006 26.3836 18.2896 12.1305 10.9711 3.0931 112.2930 28.9586 2.4446 20.2948 66.7437 28.2273 21.0568 16.0678 13.4473 11.4905 3.1239 13.0641 22.9648 2.5586 9.7745 42.4939 8.5698 10.4953 7.3950 27.0047 3.7183
temp: 298.150 k
press: 1.00000 atm
elementType: 8 6 6 6 6 6 6 6 6 6 6 6 6 6 6 6 6 6 1 1 1 1 1 1 1 1 1 1 1 1 1 1 1 1
symmnumber: 1
zpe: 724342.3 jmol-1
zpe.correction: 0.275887 hartree
zpe.thermalcorrener: 0.291102 hartree
zpe.thermalcorrenthalpy: 0.292047 hartree
zpe.thermalcorrgfe: 0.230533 hartree
zpe.sumelectzpe: -731.348919 hartree
zpe.sumelectthermal: -731.333704 hartree
zpe.sumelectthermalent: -731.332760 hartree
zpe.sumelectthermalfe: -731.394273 hartree
dipole: -0.7586 -3.2600 -1.0312
dipole: 3.5024
quadrupole: -89.4769 -108.5096 -101.8895
quadrupole: 2.1189 -1.0459 -0.0396
quadrupole: 10.4818 -8.5509 -1.9308 2.1189 -1.0459 -0.0396
hfenergy: -731.6248062 hartree
pointgroup: C01 [X(C17H16O1)]
dipole: -0.3116589 -1.084775 0.7904627 debye
polarizability: 266.7283119|-9.3014302|160.6086134|7.2994052|-23.9051715|153.0754971 unknown
InChI: InChI=1S/C17H16O/c1-12-7-9-14(10-8-12)17(18)16-11-15(16)13-5-3-2-4-6-13/h2-10,15-16H,11H2,1H3
charge 0 multiplicity 1
34 atoms
O  -0.927931 1.91269 -1.885568
C  1.722216 0.768264 -1.048867
C  0.381395 -0.018028 -1.327267
C  1.392786 0.27184 -2.447768
C  2.777918 0.157602 -0.184874
C  -0.88392 0.779642 -1.302941
C  -2.08866 0.247114 -0.583349
C  3.38757 0.94626 0.827367
C  3.194656 -1.194112 -0.32761
C  4.383885 0.405503 1.66929
C  4.188224 -1.737341 0.514624
C  -2.056212 -0.888296 0.269731
C  -3.324393 0.9304 -0.754334
C  4.788721 -0.940535 1.517888
C  -3.225324 -1.322882 0.928561
C  -4.487954 0.48721 -0.102296
C  -4.460616 -0.647045 0.755301
C  -5.712064 -1.10288 1.482105
H  1.552444 1.839691 -0.893673
H  0.356186 -1.037905 -0.937685
H  1.0789 1.027619 -3.173272
H  1.957388 -0.573961 -2.850106
H  3.077052 1.990851 0.952465
H  2.747121 -1.827456 -1.103738
H  4.842919 1.032746 2.441845
H  4.497949 -2.781031 0.387877
H  -1.120844 -1.430567 0.442695
H  -3.337387 1.808596 -1.408392
H  5.561362 -1.362553 2.169966
H  -3.180423 -2.19817 1.587654
H  -5.433286 1.022239 -0.254765
H  -6.609523 -0.998339 0.846724
H  -5.636571 -2.15659 1.801302
H  -5.883685 -0.492976 2.390507
