program: Gaussian 09
title: 000298189
version: EM64L-G09RevD.01
frameworkgroup: C1[X(C14H15N3)]
method: RPBEPBE
basis: SDD
operation: Freq
keyword: #pfreq=noraman
keyword: PBEPBE/SDD
title: #p freq=noraman PBEPBE/SDD
converged: YES YES NO NO
title: Mulliken charges:
elementType: N N N C C C C C C C C C C C C C C H H H H H H H H H H H H H H H
charge: -0.462949 -0.024731 -0.709143 0.336890 0.059919 0.527324 -0.625141 0.555211 -0.379460 -0.362212 -0.429369 -0.810913 -0.466005 -0.147980 -0.242709 -0.229031 -0.243796 0.202126 0.208688 0.264362 0.264343 0.288764 0.251948 0.239847 0.227505 0.214775 0.215145 0.221484 0.223374 0.226518 0.305308 0.299906
chargesum: 0.00000
title: Mulliken charges with hydrogens summed into heavy atoms:
elementType: N N N C C C C C C C C C C C C C C
charge: -0.174185 -0.024731 -0.103929 0.336890 0.059919 0.527324 -0.423015 0.555211 -0.170772 -0.097850 -0.165026 -0.091612 -0.251229 0.067165 -0.021224 -0.005656 -0.017278
polarizability: 3.72455345e+02 -2.60745896e+00 1.82023208e+02 -3.74760109e+00 -2.45805620e+00 7.50325065e+01
1716.lowfreq: -8.4486 -0.0007 -0.0004 -0.0002 1.1403 6.1488 25.9588 32.4275 53.9693
frequency: 25.9178 32.4169 53.9600 72.3599 118.9292 135.4273 173.7083 218.1831 230.3446 234.1653 304.0778 313.7879 322.1468 355.9029 363.4648 403.3848 417.6077 439.5720 451.3206 503.3679 522.4790 527.9528 576.1586 590.9510 613.0334 616.1775 651.2770 688.7237 695.0351 734.0800 770.6030 775.8973 813.5553 841.5771 843.9715 859.6190 917.4619 933.6685 965.1763 966.1853 975.7389 976.7958 985.8213 996.9912 1020.9288 1026.0374 1031.9090 1068.4190 1086.2597 1095.6949 1144.0608 1167.9555 1171.0564 1191.4836 1224.0623 1300.9516 1313.1796 1324.2746 1346.4498 1379.0884 1390.0914 1396.4560 1429.3780 1434.6528 1464.9237 1480.4263 1489.1804 1501.6912 1527.1324 1547.5108 1581.6854 1600.2773 1611.1875 1631.2556 1641.5154 2951.6627 3016.3719 3098.7587 3119.9916 3121.5155 3122.8041 3130.8603 3145.1575 3145.2094 3158.6478 3170.5533 3194.3318 3432.2664 3571.3762 3712.3441
redmass: 3.8681 4.3389 4.9530 3.1600 1.7896 2.0610 3.9035 3.5707 4.8957 5.0531 2.9671 3.7915 1.2517 1.0433 3.4107 2.8359 3.1558 2.1227 2.7250 4.1404 4.5462 2.7997 4.4363 2.2218 4.4543 6.3423 5.7417 1.6790 1.7201 5.2402 1.8642 1.3591 3.8353 2.2134 1.2623 1.4462 1.4418 3.1961 1.3382 2.1922 1.3952 5.8519 5.4051 1.3331 2.4380 1.5591 1.5913 2.0676 1.7014 1.3837 2.8335 1.0874 1.0548 1.1313 1.9693 1.6989 1.3726 2.4049 2.9495 5.5320 1.2829 6.5431 2.0174 2.3219 1.3004 1.4356 1.6195 2.7874 2.8738 2.8294 5.8883 5.8126 6.1431 3.2659 1.3869 1.0421 1.0971 1.0905 1.0897 1.0866 1.0868 1.0880 1.0932 1.0951 1.0968 1.0981 1.0942 1.0739 1.0448 1.1040
irintensity: 0.6172 0.4300 0.1822 2.4071 4.3366 0.4425 3.1651 7.4996 0.3226 2.3959 0.6172 2.2357 301.9212 7.9417 1.0075 0.0958 13.6028 20.9131 6.7473 9.4780 10.3499 36.4819 5.2782 12.0464 2.1148 0.2899 1.7509 34.6087 50.7446 5.9921 64.3179 25.3504 27.0519 80.8318 0.2547 3.6666 5.3721 3.6834 3.5544 16.6060 0.6075 1.3027 1.7642 1.0572 15.0339 2.6101 2.1787 4.0361 21.9828 12.5600 71.4703 46.4015 3.4186 0.7230 301.3724 6.6899 8.9929 26.4732 1.7198 5.5342 25.6102 48.1048 4.5669 16.5698 30.1306 33.6041 120.8194 114.7433 111.7761 189.3496 20.5322 126.1967 8.6067 230.9472 381.1293 26.3550 21.5158 22.8923 14.5211 11.2688 2.2590 3.4262 23.5342 51.8633 37.7325 14.1771 2.0876 0.4162 73.3328 18.8839
temp: 298.150 k
press: 1.00000 atm
elementType: 7 7 7 6 6 6 6 6 6 6 6 6 6 6 6 6 6 1 1 1 1 1 1 1 1 1 1 1 1 1 1 1
symmnumber: 1
zpe: 680196.7 jmol-1
zpe.correction: 0.259073 hartree
zpe.thermalcorrener: 0.274774 hartree
zpe.thermalcorrenthalpy: 0.275718 hartree
zpe.thermalcorrgfe: 0.214975 hartree
zpe.sumelectzpe: -705.517304 hartree
zpe.sumelectthermal: -705.501604 hartree
zpe.sumelectthermalent: -705.500660 hartree
zpe.sumelectthermalfe: -705.561403 hartree
dipole: -2.1583 3.3557 0.1428
dipole: 3.9924
quadrupole: -73.7691 -83.5521 -109.6243
quadrupole: -4.9605 -1.0630 -0.5231
quadrupole: 15.2127 5.4298 -20.6425 -4.9605 -1.0630 -0.5231
hfenergy: -705.7763776 hartree
pointgroup: C01 [X(C14H15N3)]
dipole: 0.8499077 -1.3201301 0.0463459 debye
polarizability: 372.4341372|-2.5241168|181.9644002|4.6026246|3.4531681|75.1125217 unknown
InChI: InChI=1S/C14H15N3/c1-11(12-6-3-2-4-7-12)16-17-14-9-5-8-13(15)10-14/h2-10,17H,15H2,1H3
charge 0 multiplicity 1
32 atoms
N  0.911669 -0.909782 0.036047
N  -0.312913 -0.297842 0.017672
N  5.783131 -0.834218 0.050365
C  -2.707205 -0.322337 0.023105
C  -1.41169 -1.048139 0.046597
C  2.104557 -0.151486 0.006941
C  3.336465 -0.852787 0.042853
C  4.56735 -0.14382 0.015019
C  -3.940518 -0.987647 -0.230783
C  -2.745122 1.087166 0.25056
C  2.080046 1.266007 -0.057728
C  -1.347623 -2.567073 0.108264
C  4.546184 1.280501 -0.048839
C  3.309427 1.956057 -0.084089
C  -5.160897 -0.276135 -0.25354
C  -3.96148 1.793493 0.227425
C  -5.181661 1.117045 -0.022957
H  3.342818 -1.950715 0.093647
H  -3.959706 -2.063791 -0.433844
H  -1.801224 1.60378 0.447062
H  1.121884 1.78708 -0.090276
H  0.995687 -1.933439 0.059178
H  -2.337144 -3.016283 0.269126
H  -0.928805 -3.000665 -0.82328
H  -0.706771 -2.901632 0.950625
H  5.488124 1.841086 -0.070909
H  3.303256 3.051252 -0.134916
H  -6.095106 -0.812472 -0.455822
H  -3.963678 2.874208 0.410654
H  -6.128889 1.667508 -0.036978
H  6.663475 -0.32931 0.028851
H  5.810058 -1.848113 0.092474
