program: Gaussian 09
title: 000298181
version: EM64L-G09RevD.01
frameworkgroup: C1[X(C6H3BrF4N2)]
method: RPBEPBE
basis: SDD
operation: Freq
keyword: #p
keyword: freq=noraman
keyword: PBEPBE/SDD
title: #p freq=noraman PBEPBE/SDD
converged: YES YES NO NO
title: Mulliken charges:
elementType: Br F F F F N N C C C C C C H H H
charge: 0.139708 -0.178067 -0.179004 -0.154367 -0.156072 -0.421847 -0.509042 0.252555 0.049405 0.031380 0.436784 0.452156 -0.723501 0.344816 0.307270 0.307826
chargesum: 0.00000
title: Mulliken charges with hydrogens summed into heavy atoms:
elementType: Br F F F F N N C C C C C C
charge: 0.139708 -0.178067 -0.179004 -0.154367 -0.156072 -0.077030 0.106055 0.252555 0.049405 0.031380 0.436784 0.452156 -0.723501
polarizability: 1.61541398e+02 7.94046838e-01 9.53729689e+01 9.91872555e-03 -4.09764514e-02 4.03352164e+01
1716.lowfreq: -8.8569 -0.0008 -0.0007 -0.0007 3.5466 6.6487 10.0293 83.2620 120.0374
frequency: 5.0273 83.2587 120.0373 139.5661 150.2223 184.5902 191.0286 229.6200 257.4833 277.0070 288.3908 317.8371 329.5206 365.1902 406.5995 427.8443 466.8256 566.7827 570.7121 612.9229 637.7873 662.6014 731.3524 764.6183 787.3848 907.7398 1038.0591 1055.2587 1176.4254 1254.2459 1268.1274 1351.3031 1381.3162 1445.2959 1466.5442 1490.0418 1586.0251 1631.1874 1674.4354 3428.0571 3554.9571 3566.7773
redmass: 3.8974 9.0430 16.8026 15.2446 8.5744 4.9783 5.7975 23.1039 1.5773 17.9190 17.5275 9.4290 6.0551 9.1295 9.2048 12.9734 13.7303 5.3037 1.3537 12.0782 3.6255 1.6528 10.2443 11.1509 10.3744 10.0019 9.5345 12.8129 9.1713 6.1588 1.1558 6.6116 11.1691 4.4094 5.2955 2.2677 5.2593 9.4600 1.0844 1.0419 1.1026 1.0778
irintensity: 4.7233 0.0890 0.0083 0.5019 0.7149 4.4143 0.9935 0.3228 4.1770 1.4604 1.9006 4.8695 1.4796 0.7393 4.3302 0.8116 5.3299 17.2985 141.0993 0.1863 50.9227 262.6892 6.8102 6.1526 31.4789 109.1367 13.6839 3.3959 21.2235 6.4160 0.2611 77.4196 38.7234 106.7243 165.1481 171.6777 2.8924 114.0336 24.1237 0.2371 3.7140 101.6160
temp: 298.150 k
press: 1.00000 atm
elementType: 35 9 9 9 9 7 7 6 6 6 6 6 6 1 1 1
symmnumber: 1
zpe: 232374.6 jmol-1
zpe.correction: 0.088507 hartree
zpe.thermalcorrener: 0.101292 hartree
zpe.thermalcorrenthalpy: 0.102237 hartree
zpe.thermalcorrgfe: 0.046377 hartree
zpe.sumelectzpe: -751.747622 hartree
zpe.sumelectthermal: -751.734836 hartree
zpe.sumelectthermalent: -751.733892 hartree
zpe.sumelectthermalfe: -751.789752 hartree
dipole: -2.4899 -0.5054 0.0202
dipole: 2.5408
quadrupole: -74.8936 -90.0042 -79.0712
quadrupole: 1.9315 -0.0635 -0.0363
quadrupole: 6.4294 -8.6812 2.2518 1.9315 -0.0635 -0.0363
hfenergy: -751.8361286 hartree
pointgroup: C01 [X(C6H3Br1F4N2)]
dipole: -0.9965101 0.009951 -0.0780985 debye
dipolederiv: -0.4125802 -0.1257542 -0.0453504 -0.1373311 0.0244444 -0.0143793 -0.0464257 -0.0133754 0.0762604 -0.5699131 0.3596426 -0.0039237 0.3629136 -0.578441 -0.0174909 -0.0033236 -0.0179538 -0.07877 -0.2448837 -0.1853632 -0.0262153 -0.178705 -0.9111881 -0.0808309 -0.0255314 -0.0822553 -0.1020099 -0.5306599 0.3939524 0.0027051 0.3801931 -0.5712451 -0.0121909 0.0024945 -0.0109667 -0.1047027 -0.1850269 -0.1383752 -0.0171938 -0.1249627 -0.8731379 -0.073289 -0.0165871 -0.074557 -0.114258 -1.0280914 -0.2579992 -0.0565258 -0.6643765 -0.0814012 -0.018138 -0.0772191 0.0153832 -0.4879999 -0.3121537 -0.2299142 -0.0401312 -0.4454951 -0.2712164 -0.0554781 -0.0627398 -0.0399304 -0.0045474 1.2689085 0.4624737 0.1131041 0.6654821 -0.0148978 0.0338877 0.1287305 0.0183795 0.1776705 0.2587517 -0.4377154 -0.0152235 -0.7134485 0.4528774 -0.0058552 -0.0355621 0.0147844 -0.0663661 -0.2848196 0.0741472 -0.0114543 0.2647516 0.943517 0.1002055 0.0010891 0.0868136 -0.0268339 0.5578748 -0.4420055 -0.0111804 -0.2550829 0.7616372 0.029604 0.0039248 0.0159718 0.192468 0.2849071 0.1122199 0.016004 -0.0326739 0.9851582 0.0643858 0.0044949 0.0747989 0.2016687 0.5316747 0.2852314 0.0796889 0.2719051 -0.3608568 0.0104388 0.0787139 0.0112198 -0.2533038 0.1480959 0.0777273 -0.0106446 0.1735252 0.2031899 0.0003328 -0.0043431 -0.0076149 0.3592811 0.2432406 0.0136501 0.1067521 0.2031416 0.1331186 0.1211131 0.1008385 0.068599 0.1404765 0.2746753 0.0380823 -0.0804112 0.2301635 0.1584415 -0.0823152 -0.0485541 -0.0592968 0.0909668 unknown
polarizability: 158.7193907|11.1893694|97.0720676|9.3625236|5.4998022|41.458125 unknown
InChI: InChI=1S/C6H3BrF4N2/c7-1-2(8)4(10)6(13-12)5(11)3(1)9/h13H,12H2
charge 0 multiplicity 1
16 atoms
Br 3.446878 0.8873 0.317925
F  -1.759071 1.944334 0.042672
F  -0.4427 -2.73132 -0.25834
F  2.215015 -1.990865 -0.009346
F  0.850379 2.657832 0.284353
N  -2.478838 -0.906324 -0.24716
N  -3.656764 -0.132931 -0.283096
C  -1.176325 -0.435084 -0.117523
C  -0.790829 0.926025 0.023484
C  -0.104744 -1.374047 -0.120371
C  1.238045 -1.000477 0.004987
C  0.559766 1.303284 0.149509
C  1.604085 0.357114 0.14379
H  -2.613347 -1.913101 -0.337366
H  -3.712254 0.48217 -1.102648
H  -3.846099 0.356291 0.598728
