program: Gaussian 09
title: 000298192
version: EM64L-G09RevD.01
frameworkgroup: C1[X(C15H10F6O2)]
method: RPBEPBE
basis: SDD
operation: Freq
keyword: #p
keyword: freq=noraman
keyword: PBEPBE/SDD
title: #p freq=noraman PBEPBE/SDD
converged: YES YES NO NO
title: Mulliken charges:
elementType: F F F F F F O O C C C C C C C C C C C C C C C H H H H H H H H H H
charge: -0.152588 -0.152615 -0.165182 -0.168141 -0.168191 -0.165165 -0.421605 -0.421590 0.272949 0.135209 0.135218 0.292034 0.291963 -0.297805 -0.297853 -0.322520 -0.322175 -0.371563 -0.371552 -0.350727 -0.350819 0.297385 0.297356 0.263822 0.263797 0.270699 0.270706 0.230459 0.230473 0.262576 0.262582 0.361431 0.361435
chargesum: 0.00000
title: Mulliken charges with hydrogens summed into heavy atoms:
elementType: F F F F F F O O C C C C C C C C C C C C C C C
charge: -0.152588 -0.152615 -0.165182 -0.168141 -0.168191 -0.165165 -0.060174 -0.060156 0.272949 0.135209 0.135218 0.292034 0.291963 -0.033984 -0.034057 -0.051822 -0.051469 -0.141104 -0.141080 -0.088151 -0.088237 0.297385 0.297356
polarizability: 2.15581121e+02 5.22808254e-02 1.86276924e+02 -4.16415420e+01 6.93782239e-02 1.01865639e+02
1716.lowfreq: -0.0007 -0.0006 0.0008 4.1574 5.4406 10.7778 16.6217 39.0563 46.6684
frequency: 16.6129 38.9401 46.6362 50.5116 69.8757 89.2370 130.1874 147.3045 151.9607 181.5323 200.7643 238.5750 251.0432 268.2082 269.8764 286.5672 289.2712 321.7135 334.2720 360.6232 380.8712 385.8973 394.4047 394.8765 406.2111 411.2410 413.6227 459.4827 471.6015 507.8701 523.1674 527.5665 558.1573 581.9097 599.0642 619.6541 630.9850 631.1303 723.0784 725.3155 795.0586 803.3302 811.2504 811.9791 829.3154 845.3291 849.2205 922.1868 936.7349 947.0313 948.8553 972.1275 978.9113 995.0683 996.1794 999.4726 1015.9408 1019.5816 1025.8485 1110.3527 1114.2013 1131.3534 1139.5253 1146.3113 1148.1171 1188.7124 1190.5125 1255.3743 1257.2800 1266.1116 1267.3903 1319.8425 1320.0923 1397.5361 1398.1302 1430.4942 1430.8380 1506.0415 1506.0453 1596.2218 1596.3209 1627.6546 1628.1162 3128.2098 3128.3159 3161.7553 3163.6223 3175.0034 3175.1745 3182.0775 3183.1549 3580.3762 3580.5019
redmass: 7.6640 3.9134 9.7923 7.1460 4.6755 12.4147 8.3083 8.9951 8.4894 7.4639 10.7763 16.5624 15.0259 9.2465 11.5091 16.8047 13.0789 12.7517 8.7354 7.8695 5.8465 4.9863 1.1234 1.1305 4.2921 3.9275 3.0301 6.6021 7.2150 3.6041 3.5359 11.0031 8.1475 6.3433 6.0279 7.4129 7.1398 7.1285 4.1476 4.2133 4.9529 5.0789 1.4862 1.4587 2.5065 1.4959 2.5893 5.3207 7.3481 1.4081 1.4717 1.3968 1.7917 3.3528 5.1599 5.1368 5.6636 3.5342 4.4243 2.2119 1.6320 3.0101 5.0518 1.3807 1.3184 1.1217 1.1216 2.3393 2.3475 5.7445 5.9548 1.3017 1.3040 5.4343 5.4375 3.4092 3.4061 2.7164 2.7174 6.5583 6.5790 6.2265 6.2619 1.0904 1.0904 1.0885 1.0884 1.0949 1.0948 1.0974 1.0975 1.0661 1.0661
irintensity: 1.0330 3.7390 0.0375 0.2671 0.0620 0.0025 0.6766 5.2627 0.0009 1.5979 0.1379 1.8921 0.0954 4.3827 2.5118 0.6386 0.0029 0.3146 3.5648 0.4774 6.4789 11.1621 4.6423 285.0023 18.4972 2.0237 0.7170 4.2544 1.7878 0.5781 30.4796 15.4451 17.0979 3.6454 90.8849 12.1983 0.1769 2.3060 1.7260 1.0256 88.3523 3.1823 49.6170 0.0163 235.6142 0.0899 22.7690 46.3001 43.0152 0.8761 8.8530 4.5337 57.7108 89.5426 79.6280 35.4387 158.5162 0.5020 1.8646 125.0563 163.0688 7.0644 52.6821 208.3261 163.7580 30.7734 3.2983 5.9794 6.4196 246.7236 86.3398 16.3452 2.7682 24.0456 1.5305 14.4012 0.4743 42.6223 36.4840 6.6412 39.1620 159.1799 65.1059 20.5927 6.6625 3.4193 0.6675 1.6009 1.3874 0.0068 3.6978 100.2738 14.1617
temp: 298.150 k
press: 1.00000 atm
elementType: 9 9 9 9 9 9 8 8 6 6 6 6 6 6 6 6 6 6 6 6 6 6 6 1 1 1 1 1 1 1 1 1 1
symmnumber: 1
zpe: 574351.1 jmol-1
zpe.correction: 0.218759 hartree
zpe.thermalcorrener: 0.239351 hartree
zpe.thermalcorrenthalpy: 0.240295 hartree
zpe.thermalcorrgfe: 0.168705 hartree
zpe.sumelectzpe: -1325.429715 hartree
zpe.sumelectthermal: -1325.409123 hartree
zpe.sumelectthermalent: -1325.408179 hartree
zpe.sumelectthermalfe: -1325.479769 hartree
dipole: -0.0073 2.6723 -0.0064
dipole: 2.6724
quadrupole: -85.1833 -140.0509 -139.6376
quadrupole: 0.0410 -14.6250 0.0112
quadrupole: 36.4406 -18.4269 -18.0137 0.0410 -14.6250 0.0112
hfenergy: -1325.6484742 hartree
pointgroup: C01 [X(C15H10F6O2)]
dipole: 0.000281 -1.051318 -0.0120024 debye
polarizability: 213.9748522|-0.4129227|186.2732332|43.7482429|0.5738969|103.4755977 unknown
InChI: InChI=1S/C15H10F6O2/c16-13(17,9-1-5-11(22)6-2-9)15(20,21)14(18,19)10-3-7-12(23)8-4-10/h1-8,22-23H
charge 0 multiplicity 1
33 atoms
F  0.929074 2.766046 0.697878
F  -0.91961 2.782852 -0.644933
F  -1.414104 2.10752 1.937278
F  0.160038 0.440338 1.913342
F  -0.165781 0.46886 -1.895328
F  1.415404 2.129759 -1.897992
O  -4.798907 -2.5815 -0.692454
O  4.78607 -2.613607 0.649921
C  0.002053 1.924276 0.019552
C  -0.807242 1.107379 1.09376
C  0.805978 1.119861 -1.068084
C  -1.853005 0.144348 0.601261
C  1.848537 0.145024 -0.592294
C  -3.0428 0.645418 0.019108
C  3.042409 0.631775 -0.00636
C  -1.675278 -1.253578 0.750148
C  1.663919 -1.249663 -0.76185
C  -4.041021 -0.24203 -0.422589
C  4.03793 -0.26685 0.418553
C  -2.669162 -2.145766 0.312467
C  2.655053 -2.152919 -0.341051
C  -3.851184 -1.639535 -0.277555
C  3.841282 -1.661114 0.252741
H  -3.190072 1.72376 -0.087254
H  3.194981 1.707714 0.115794
H  -0.766005 -1.639248 1.219948
H  0.75144 -1.623901 -1.234679
H  -4.96028 0.151628 -0.873755
H  4.960396 0.115725 0.872684
H  -2.552973 -3.227269 0.423048
H  2.533572 -3.232055 -0.467859
H  -5.590971 -2.144252 -1.093312
H  5.581361 -2.186195 1.054967
