program: Gaussian 09
title: 000298202
version: EM64L-G09RevD.01
frameworkgroup: C1[X(C14H2F10N2O2)]
method: RPBEPBE
basis: SDD
operation: Freq
keyword: #p
keyword: freq=noraman
keyword: PBEPBE/SDD
title: #p freq=noraman PBEPBE/SDD
converged: YES YES NO NO
title: Mulliken charges:
elementType: F F F F F F F F F F O O N N C C C C C C C C C C C C C C H H
charge: -0.119794 -0.119832 -0.161234 -0.161183 -0.136391 -0.136394 -0.136980 -0.136981 -0.131204 -0.131214 -0.255192 -0.255125 -0.325637 -0.325521 0.092991 0.093038 0.220011 0.219918 0.101038 0.101019 0.163247 0.163162 0.097273 0.097241 0.076209 0.076200 0.128224 0.128242 0.387453 0.387417
chargesum: 0.00000
title: Mulliken charges with hydrogens summed into heavy atoms:
elementType: F F F F F F F F F F O O N N C C C C C C C C C C C C C C
charge: -0.119794 -0.119832 -0.161234 -0.161183 -0.136391 -0.136394 -0.136980 -0.136981 -0.131204 -0.131214 -0.255192 -0.255125 0.061816 0.061897 0.092991 0.093038 0.220011 0.219918 0.101038 0.101019 0.163247 0.163162 0.097273 0.097241 0.076209 0.076200 0.128224 0.128242
polarizability: 3.35936096e+02 4.49018549e+00 1.78118142e+02 -3.78319132e-03 8.56936415e-03 9.46914107e+01
1716.lowfreq: -3.0178 -2.2770 -0.0008 -0.0004 0.0007 1.7900 8.5102 18.6672 19.4223
frequency: 8.5097 18.6642 19.4205 30.9800 67.8095 71.6191 95.9338 116.7833 118.8862 120.3916 147.0956 148.8248 160.8937 173.7756 201.3501 204.7712 256.6243 256.6434 264.8808 265.5904 271.0088 290.7277 291.2231 300.5993 301.7777 310.5152 334.7937 344.3017 362.0023 368.9283 369.2327 392.5720 424.2441 424.4851 446.9085 474.2920 480.1804 545.4363 546.5264 574.0224 578.9371 632.7187 635.9681 640.0085 640.2923 687.5719 703.0160 718.0680 732.9493 753.5006 768.9615 784.6480 786.2420 878.6878 925.0403 929.3737 963.1811 1036.1281 1042.4605 1072.3755 1073.2503 1133.2645 1187.9534 1226.2719 1258.1546 1270.9639 1356.0566 1359.9629 1362.5845 1368.4056 1411.0485 1435.8265 1437.5775 1468.4780 1472.2294 1531.7147 1547.6646 1584.7199 1597.3313 1608.8325 1620.7989 1621.3464 3472.7500 3483.0088
redmass: 17.5914 14.1890 13.8121 14.7933 15.1543 12.8105 10.7312 15.2300 18.5380 16.0076 15.1639 15.9037 16.2719 12.8457 13.8262 13.6697 17.5355 18.5560 17.2806 18.4123 9.4126 17.6691 16.6917 13.3180 10.1130 15.6739 15.7713 14.2191 10.5599 12.6127 12.4996 12.2657 15.9950 16.0528 9.7890 16.0533 13.8971 17.2603 16.6622 3.7993 11.5937 1.8410 1.2017 5.8853 8.0090 12.2815 7.3965 6.8162 12.7329 10.4391 11.5419 11.9319 11.0048 12.1493 13.6291 13.8101 8.2503 5.4807 9.9885 13.3014 13.5435 10.5657 3.0273 4.8470 3.1103 4.3012 8.8707 11.9759 10.2547 12.1008 3.0365 12.3425 12.2565 11.9444 10.8400 2.0924 12.7090 10.2377 12.0241 8.4822 11.9967 12.0299 1.0816 1.0796
irintensity: 0.0097 0.0047 1.3234 0.0575 0.0303 2.4291 9.1077 0.4965 0.1353 0.4249 0.1247 0.2406 0.5039 4.7872 7.7337 12.3889 0.5750 0.1385 0.7381 0.0014 0.8725 1.0615 5.8735 7.4328 0.0034 0.0129 0.3298 5.3049 18.0424 0.1058 0.1429 0.5725 0.0984 0.6308 34.3683 0.0840 3.1580 0.0163 0.2514 3.3883 12.7616 5.1096 173.3239 22.2947 1.9156 7.6498 10.4339 61.5208 2.7370 0.0524 0.2835 5.4080 0.3963 95.1924 76.5084 224.4525 0.2944 1.3152 86.6759 0.0719 11.9189 5.3841 5.7718 0.0008 26.2611 3.0717 16.0554 0.2697 6.7429 1.9592 1194.3411 266.5509 132.0830 5.7482 70.1068 0.0003 625.5071 0.6519 30.6579 0.0227 84.0655 0.1924 0.1025 162.2748
temp: 298.150 k
press: 1.00000 atm
elementType: 9 9 9 9 9 9 9 9 9 9 8 8 7 7 6 6 6 6 6 6 6 6 6 6 6 6 6 6 1 1
symmnumber: 1
zpe: 385218.8 jmol-1
zpe.correction: 0.146722 hartree
zpe.thermalcorrener: 0.171648 hartree
zpe.thermalcorrenthalpy: 0.172592 hartree
zpe.thermalcorrgfe: 0.088470 hartree
zpe.sumelectzpe: -1790.978515 hartree
zpe.sumelectthermal: -1790.953589 hartree
zpe.sumelectthermalent: -1790.952645 hartree
zpe.sumelectthermalfe: -1791.036767 hartree
dipole: 0.0016 0.0001 0.1143
dipole: 0.1143
quadrupole: -167.7620 -174.6192 -152.0934
quadrupole: -6.3803 -0.0027 -0.0041
quadrupole: -2.9371 -9.7943 12.7315 -6.3803 -0.0027 -0.0041
hfenergy: -1791.1252374 hartree
pointgroup: C01 [X(C14H2F10N2O2)]
dipole: 0.0005514 -0.000291 -0.0449607 debye
polarizability: 336.0474874|-1.5666627|178.0031044|-0.4247303|-0.4887382|94.695057 unknown
InChI: InChI=1S/C14H2F10N2O2/c15-3-1(4(16)8(20)11(23)7(3)19)13(27)25-26-14(28)2-5(17)9(21)12(24)10(22)6(2)18/h25-26H
charge 0 multiplicity 1
30 atoms
F  3.76253 -2.287812 -1.23418
F  -3.768918 2.271568 -1.248551
F  2.564534 1.786752 1.159902
F  -2.562091 -1.772939 1.191452
F  5.219646 2.490961 1.244263
F  -5.216898 -2.476363 1.293702
F  6.397102 -1.560682 -1.116358
F  -6.403119 1.545706 -1.112668
F  7.161121 0.823109 0.116055
F  -7.162486 -0.822732 0.151815
O  1.312116 -1.999276 0.024861
O  -1.314471 1.999063 0.007803
N  0.664378 0.208238 -0.022353
N  -0.666523 -0.20883 -0.017841
C  3.066755 -0.295464 -0.007519
C  -3.068811 0.294688 0.000257
C  1.638897 -0.77197 0.006258
C  -1.641026 0.771578 0.003539
C  4.078287 -1.109053 -0.583122
C  -4.082398 1.100939 -0.581891
C  3.498379 0.916293 0.584757
C  -3.498109 -0.909767 0.608927
C  4.849108 1.300705 0.640106
C  -4.848589 -1.293592 0.673691
C  5.438764 -0.743227 -0.540741
C  -5.44267 0.735535 -0.530313
C  5.827613 0.461889 0.073768
C  -5.82918 -0.461926 0.100418
H  0.786701 1.227292 0.026242
H  -0.788645 -1.227285 0.042418
