program: Gaussian 09
title: 000298180
version: EM64L-G09RevD.01
frameworkgroup: C1[X(C12H4F6)]
method: RPBEPBE
basis: SDD
operation: Freq
keyword: #pfreq=noraman
keyword: PBEPBE/SDD
title: #p freq=noraman PBEPBE/SDD
converged: NO NO NO NO
title: Mulliken charges:
elementType: F F F F F F C C C C C C C C C C C C H H H H
charge: -0.152124 -0.152124 -0.171260 -0.171260 -0.171927 -0.171926 0.003598 0.003598 0.129891 0.129891 0.264614 0.264614 0.190618 0.190618 -0.342920 -0.342920 -0.289050 -0.289050 0.268438 0.268438 0.270121 0.270120
chargesum: 0.00000
title: Mulliken charges with hydrogens summed into heavy atoms:
elementType: F F F F F F C C C C C C C C C C C C
charge: -0.152124 -0.152124 -0.171260 -0.171260 -0.171927 -0.171926 0.003598 0.003598 0.129891 0.129891 0.264614 0.264614 0.190618 0.190618 -0.074482 -0.074482 -0.018929 -0.018929
polarizability: 1.73440344e+02 2.85442758e-04 1.00468795e+02 -9.87164931e+00 -4.66126878e-05 1.00693888e+02
1716.lowfreq: -27.6735 -13.1768 -7.7501 -6.3243 -0.0010 -0.0008 -0.0005 54.8764 55.9870
frequency: -27.6717 54.8415 55.9637 131.4578 131.9966 144.4623 145.2060 185.2569 266.6221 270.3623 299.4526 300.0605 320.2724 358.8202 360.7003 373.6711 436.5278 436.6625 489.6340 503.0007 538.3835 564.1165 574.4148 600.3035 602.2774 604.4157 701.5706 707.7599 734.7909 749.3453 796.6267 811.7875 812.6860 915.0539 927.4804 927.8393 962.3870 997.4064 1100.5483 1151.0528 1154.5574 1211.8672 1213.2516 1230.6949 1269.6114 1286.2804 1368.0061 1368.7301 1413.4411 1459.2728 1463.6698 1492.5752 1594.2371 1594.7574 1618.5307 1631.8556 3173.7236 3173.7350 3192.0887 3192.1215
redmass: 12.6376 9.6273 9.3019 15.1423 14.9546 10.6070 10.6055 14.3690 17.9612 17.9346 7.4125 7.3231 14.2414 7.4329 7.3156 12.9929 13.2222 13.2589 6.3700 5.2275 6.7326 4.5207 5.1763 9.0595 5.0297 4.9397 8.9947 8.9982 8.2081 7.7008 6.0341 1.4562 1.6125 7.9704 1.3255 1.3391 6.2360 4.1368 2.3758 1.5190 1.9831 1.8651 1.8100 6.5258 6.1389 5.0237 11.7489 11.9680 5.8855 4.5872 3.7328 5.8376 8.3874 8.2494 9.6060 10.3882 1.0891 1.0891 1.0979 1.0979
irintensity: 0.3301 1.3157 1.5717 0.6784 0.7806 1.7258 1.7280 0.0187 0.5962 0.4751 0.3797 0.1806 12.0070 0.0490 0.0486 0.2055 0.0867 0.1062 4.3017 0.0386 10.5883 0.4664 1.4028 7.3947 6.1791 11.3768 16.8839 7.5949 7.9659 0.0126 34.6385 54.2441 79.5823 78.2755 0.0131 1.5164 74.3940 16.8076 48.8357 0.1327 13.8839 72.0717 40.5457 0.3428 13.6211 5.5458 0.3758 0.1523 15.8044 208.5184 237.6274 6.9820 14.0385 2.4675 11.0562 1.7745 0.5927 0.7977 0.0275 0.0105
temp: 298.150 k
press: 1.00000 atm
elementType: 9 9 9 9 9 9 6 6 6 6 6 6 6 6 6 6 6 6 1 1 1 1
symmnumber: 1
zpe: 335841.0 jmol-1
zpe.correction: 0.127915 hartree
zpe.thermalcorrener: 0.141926 hartree
zpe.thermalcorrenthalpy: 0.142870 hartree
zpe.thermalcorrgfe: 0.086840 hartree
zpe.sumelectzpe: -1057.451637 hartree
zpe.sumelectthermal: -1057.437626 hartree
zpe.sumelectthermalent: -1057.436681 hartree
zpe.sumelectthermalfe: -1057.492712 hartree
dipole: 0.0000 2.3613 0.0000
dipole: 2.3613
quadrupole: -82.3612 -105.3960 -101.7599
quadrupole: 0.0001 -14.8955 0.0000
quadrupole: 14.1445 -8.8903 -5.2541 0.0001 -14.8955 0.0000
hfenergy: -1057.5795517 hartree
pointgroup: C01 [X(C12H4F6)]
dipole: 0.000006 0.9290064 -0.0000406 debye
dipolederiv: -0.3185205 0.1796768 0.2154477 0.1344609 -0.4370555 -0.3648055 0.1709248 -0.3711489 -0.4966787 -0.3185248 -0.1796599 0.2154673 -0.134446 -0.4369826 0.3647927 0.1709442 0.3711471 -0.4967484 -0.4881006 -0.28982 -0.232466 -0.2590191 -0.4648488 -0.30684 -0.1986902 -0.3020524 -0.3872027 -0.4880944 0.2897979 -0.2324906 0.2589987 -0.4647946 0.3068493 -0.1987134 0.3020635 -0.3872633 -0.5658244 -0.3151697 -0.2445994 -0.380964 -0.4561525 -0.2875297 -0.3083158 -0.2961295 -0.3586095 -0.5658155 0.3151477 -0.244624 0.3809401 -0.4561136 0.2875467 -0.3083446 0.2961377 -0.3586577 0.1557718 0.0064836 -0.0294309 -0.0277164 -0.1134528 -0.0375625 -0.0708698 -0.0434171 -0.1024595 0.1557721 -0.0064907 -0.0294313 0.0277076 -0.1134442 0.0375647 -0.0708688 0.0434184 -0.1024691 0.3151894 -0.298314 -0.3307975 -0.0595978 0.4721554 0.377857 -0.0948884 0.4125811 0.5401992 0.3151948 0.2982887 -0.3308256 0.059589 0.4720737 -0.3778403 -0.0949018 -0.4125809 0.5402772 0.5123631 0.3436268 0.2801682 0.2162257 0.5078691 0.3700989 0.1483994 0.3516231 0.4281289 0.5123573 -0.3436004 0.280197 -0.2162064 0.5078055 -0.3701101 0.1484196 -0.3516334 0.4281992 0.4803611 0.4735362 0.4082483 0.416946 0.433181 0.3085299 0.3507925 0.2971198 0.3030608 0.4803487 -0.4734992 0.4082864 -0.4169204 0.4331488 -0.3085527 0.35082 -0.2971302 0.3031054 -0.1636465 -0.1463763 -0.1454312 0.0470345 -0.117257 0.0273695 0.0486271 0.0586961 -0.1000603 -0.1636449 0.1463657 -0.1454432 -0.0470262 -0.1172666 -0.0273706 0.0486357 -0.058691 -0.1000536 0.0046363 0.0531531 0.0316719 -0.0728794 -0.064202 0.0731735 -0.0949807 0.0532318 -0.0575424 0.0046366 -0.0531523 0.031676 0.0728627 -0.0642205 -0.07317 -0.0949938 -0.0532324 -0.0575227 0.0707081 0.0159757 0.0336021 0.0138549 0.0973895 -0.0868009 0.0318435 -0.087278 0.0891202 0.070707 -0.0159734 0.0336037 -0.013855 0.097407 0.0868009 0.0318419 0.0872759 0.0891043 -0.0029377 -0.0160603 0.013586 -0.0125652 0.1423765 -0.037028 0.0171564 -0.0364367 0.1420409 -0.0029369 0.0160637 0.0135851 0.0125759 0.1423841 0.037027 0.0171623 0.0364359 0.1420316 unknown
polarizability: 173.6634141|-0.0005531|100.4687953|-9.0095573|-0.0000004|100.4708176 unknown
InChI: InChI=1S/C12H4F6/c13-5-1-3-7(15)11(17)9(5)10-6(14)2-4-8(16)12(10)18/h1-4H
charge 0 multiplicity 1
22 atoms
F  -1.061378 -1.533388 -1.546422
F  1.061374 -1.533259 1.546538
F  -0.508571 1.898464 1.803398
F  0.508609 1.898283 -1.803606
F  -3.801832 -1.532965 -1.104353
F  3.801829 -1.532905 1.104476
C  -0.737456 0.185718 0.122483
C  0.737474 0.185699 -0.122523
C  -1.598094 -0.669912 -0.5949
C  1.5981 -0.669881 0.594934
C  -1.338998 1.039226 1.075961
C  1.339026 1.039107 -1.076084
C  -2.990738 -0.66773 -0.368176
C  2.990748 -0.667718 0.368229
C  -2.72257 1.061134 1.321488
C  2.722598 1.060974 -1.321615
C  -3.556856 0.192614 0.585681
C  3.556878 0.192542 -0.585697
H  -3.131708 1.742585 2.071592
H  3.131743 1.742344 -2.071788
H  -4.638622 0.175685 0.743987
H  4.638644 0.175581 -0.744004
