program: Gaussian 09
title: 000298243
version: EM64L-G09RevD.01
frameworkgroup: C1[X(C21H24O10S2)]
method: RPBEPBE
basis: SDD
operation: Freq
keyword: #p
keyword: freq=noraman
keyword: PBEPBE/SDD
title: #p freq=noraman PBEPBE/SDD
converged: YES YES NO NO
title: Mulliken charges:
elementType: S S O O O O O O O O O O C C C C C C C C C C C C C C C C C C C C C H H H H H H H H H H H H H H H H H H H H H H H H
charge: 1.063327 1.064113 -0.235580 -0.420552 -0.438141 -0.304537 -0.304443 -0.510086 -0.495633 -0.509300 -0.506129 -0.254023 -0.218218 -0.078948 -0.026563 0.034633 -0.373110 -0.456635 0.227053 -0.731295 -0.748476 0.429644 0.210603 -0.375366 -0.363852 -0.340048 -0.331767 -0.227789 -0.227354 -0.231833 -0.220957 -0.219842 -0.220135 0.336873 0.319017 0.276153 0.233825 0.267574 0.226851 0.214138 0.249501 0.281305 0.286297 0.328369 0.278847 0.284485 0.339962 0.249570 0.225223 0.268853 0.274192 0.233061 0.229359 0.233748 0.234260 0.236484 0.233291
chargesum: 0.00000
title: Mulliken charges with hydrogens summed into heavy atoms:
elementType: S S O O O O O O O O O O C C C C C C C C C C C C C C C C C C C C C
charge: 1.063327 1.064113 -0.235580 -0.420552 -0.438141 -0.304537 -0.304443 -0.510086 -0.495633 -0.509300 -0.506129 -0.254023 0.118656 0.240068 0.249589 0.268458 0.121315 0.007004 0.227053 0.164676 0.154819 0.429644 0.210603 -0.125797 -0.138629 -0.071195 -0.057574 0.005272 0.002006 0.001914 0.013302 0.016642 0.013156
polarizability: 3.71153059e+02 -3.84586878e+01 2.48570902e+02 1.48608328e+01 4.51066910e+00 3.23333577e+02
1716.lowfreq: -7.6275 -4.8322 -0.0012 -0.0005 0.0003 4.9155 9.8507 13.8446 18.2146
frequency: 9.4337 13.7023 18.1529 23.4415 25.2023 28.4484 32.5103 37.7740 47.5484 54.4291 63.3096 78.9922 92.3987 97.3490 125.0364 140.1549 143.7403 150.9345 154.0768 161.7089 166.4533 176.1844 176.9466 183.2167 212.2421 227.3061 231.9134 241.8019 251.7121 254.9127 272.9434 302.8774 323.0921 329.3115 340.3418 346.2880 349.4076 356.5650 364.8848 401.3743 403.1962 408.4719 425.8000 442.2458 459.3006 472.6363 482.2037 494.7936 503.9784 515.4479 564.6090 579.4314 591.2852 605.0426 613.5234 617.2660 661.8308 666.8572 680.5528 701.1072 702.1252 746.7376 765.6780 795.7552 809.1195 815.1479 828.8558 833.9799 837.1282 854.0148 864.3250 871.2360 878.5010 898.0921 921.3499 928.3295 929.9125 930.9565 955.7761 964.0626 971.3595 978.8038 982.1362 990.2382 990.6520 994.8099 996.4442 999.9833 1004.5621 1009.6431 1012.8308 1023.3269 1025.9741 1031.7440 1051.7747 1055.5460 1064.1331 1075.7776 1086.7935 1088.6407 1095.7404 1148.1021 1174.2502 1174.6695 1184.5946 1186.6325 1207.8275 1215.5185 1219.4974 1237.0408 1251.9342 1267.4178 1294.9655 1311.2800 1317.3293 1320.3882 1321.1878 1324.7513 1325.3542 1325.7764 1339.8612 1344.3507 1354.1248 1359.2631 1385.1155 1390.4304 1406.6463 1407.3924 1423.0421 1429.3547 1438.3847 1440.6146 1448.4421 1472.9245 1478.1420 1483.7856 1584.3165 1594.1930 1611.2952 1613.5054 1622.6087 2954.7602 2970.7295 2987.2139 2993.8575 3009.5385 3027.8607 3033.4798 3053.2872 3100.7939 3116.5297 3118.0827 3123.8060 3131.8331 3135.8315 3144.9175 3148.4560 3156.4788 3159.3597 3165.6473 3167.7419 3179.6783 3180.4545 3185.3956 3187.7794
redmass: 4.9458 6.6350 7.5862 5.7511 4.8173 6.0537 6.0408 5.9295 5.9801 6.5284 6.7094 5.6283 7.0893 7.4011 3.4443 5.3633 2.7009 3.1695 5.6086 2.2426 4.1495 4.0312 1.6266 2.8334 5.6735 6.5713 5.1883 4.5826 4.5089 6.6302 6.2127 6.9389 5.4638 3.6194 4.0893 8.2384 4.2913 8.7583 7.7132 2.8023 2.8210 6.8123 5.0011 4.0419 4.8505 6.1826 5.8692 4.7107 5.5330 5.7503 7.0449 9.0250 8.7716 4.1622 6.4425 6.3101 6.8831 6.3157 5.1811 1.5990 1.7930 2.9108 3.3665 2.1937 5.5292 3.6158 5.3782 13.2803 10.2765 1.2589 1.2450 4.8480 4.0335 4.9381 3.5985 2.6789 2.7314 1.7152 1.4174 2.0264 3.9248 1.4116 4.0855 6.1292 6.1078 1.3379 1.3892 1.3248 1.5189 1.3394 3.1060 2.6909 2.2419 2.8316 3.1426 1.9370 1.7971 3.1275 1.7233 1.7010 1.9072 2.7061 1.0550 1.0584 1.1275 1.1107 1.2718 2.3629 1.2947 2.9089 1.3860 1.3371 1.3211 1.3323 1.3094 1.1726 1.1546 1.2268 1.2271 1.2839 1.2592 1.3774 1.3510 1.3307 8.0399 9.9027 1.0487 1.0493 1.0522 1.0545 2.2487 2.1367 1.0812 1.1734 2.2764 2.0992 6.6651 6.0745 6.1058 6.1104 10.6930 1.0835 1.0681 1.0825 1.0847 1.0256 1.0240 1.0582 1.0860 1.1081 1.0878 1.0959 1.0872 1.0857 1.0910 1.0891 1.0959 1.0938 1.1073 1.1015 1.0980 1.0983 1.1088 1.1079 1.1078
irintensity: 0.0776 0.1790 0.4984 1.2516 0.0820 0.4300 1.4077 4.3372 1.0046 2.2367 1.6998 6.5456 1.8991 1.7375 2.8721 4.7828 5.7481 5.1842 0.9709 3.1745 5.5940 0.5626 0.5033 4.4172 0.3921 4.4584 1.8106 6.8733 0.0096 1.5687 11.2198 1.5460 6.3923 12.5996 24.3726 51.5834 0.6386 38.1315 14.3585 0.1402 0.0599 27.5720 24.2881 5.0380 20.3701 57.6465 0.6675 5.2645 12.7729 2.1515 12.4462 30.4763 76.0844 29.3534 0.4780 0.1213 8.3981 37.5582 19.2503 87.8426 55.1067 73.2617 30.4534 22.8753 14.0143 23.7495 5.8263 46.2805 85.1573 1.7338 0.1685 43.1708 43.5040 55.9182 63.6911 63.7442 25.4908 9.2019 3.0366 23.5647 49.7998 2.2477 235.0142 1.5155 2.7776 57.8110 0.1925 0.7038 19.3709 1.9753 97.6528 81.5632 6.3266 1.7005 331.3127 69.1486 40.0238 89.7732 13.7054 23.5917 13.5060 13.9216 0.0098 1.1262 49.8533 0.4546 5.5562 28.2578 2.3867 419.2492 6.1281 3.0024 38.3049 0.3045 0.7260 2.1765 9.5533 7.5444 7.7085 5.5737 8.3899 3.9792 4.1032 3.2002 0.2243 3.0269 3.7015 11.0785 13.0239 19.3480 20.4875 9.3816 19.6752 16.2518 6.5785 6.0980 32.4041 0.8731 17.4452 0.3369 164.9603 35.8425 32.6100 1.6609 6.0161 25.7946 10.3369 35.9617 8.9667 6.6903 9.6012 9.3812 3.1330 0.7772 9.1494 9.0493 32.4780 13.4400 22.9279 19.6588 22.7548 8.8327 12.3439 0.2926 2.2238
temp: 298.150 k
press: 1.00000 atm
elementType: 16 16 8 8 8 8 8 8 8 8 8 8 6 6 6 6 6 6 6 6 6 6 6 6 6 6 6 6 6 6 6 6 6 1 1 1 1 1 1 1 1 1 1 1 1 1 1 1 1 1 1 1 1 1 1 1 1
symmnumber: 1
zpe: 1109114.8 jmol-1
zpe.correction: 0.422440 hartree
zpe.thermalcorrener: 0.456684 hartree
zpe.thermalcorrenthalpy: 0.457628 hartree
zpe.thermalcorrgfe: 0.350259 hartree
zpe.sumelectzpe: -2360.165232 hartree
zpe.sumelectthermal: -2360.130988 hartree
zpe.sumelectthermalent: -2360.130044 hartree
zpe.sumelectthermalfe: -2360.237413 hartree
dipole: -5.3183 -4.6014 3.5175
dipole: 7.8632
quadrupole: -168.9414 -223.3082 -211.3395
quadrupole: -9.8298 -0.0820 1.1909
quadrupole: 32.2550 -22.1118 -10.1431 -9.8298 -0.0820 1.1909
hfenergy: -2360.587672 hartree
pointgroup: C01 [X(C21H24O10S2)]
dipole: -2.3417458 1.6871228 -1.1137405 debye
polarizability: 357.1439123|56.4811523|263.4357366|-6.317594|-7.9055465|322.4778892 unknown
InChI: InChI=1S/C21H24O10S2/c1-32(23,24)30-18-17(29-20(22)16-11-7-4-8-12-16)14-28-21(19(18)31-33(2,25)26)27-13-15-9-5-3-6-10-15/h3-12,17-19,21H,13-14H2,1-2H3
charge 0 multiplicity 1
57 atoms
S  -0.383822 -4.141855 0.989052
S  -0.676957 -1.261476 -3.27968
O  -0.472391 1.261393 1.043142
O  -0.593305 -2.252968 1.250338
O  -1.06142 -1.503706 -1.429273
O  2.229485 0.064096 0.787666
O  -1.814014 1.254075 -0.884027
O  1.025627 -4.366187 0.21901
O  -0.678641 -4.811006 2.423801
O  0.716995 -0.444844 -3.406522
O  -0.871056 -2.73541 -3.902472
O  3.308998 0.54494 2.796651
C  0.408546 -1.461643 0.518651
C  -0.311798 -0.603474 -0.546011
C  1.124462 -0.568759 1.554478
C  -1.261151 0.405814 0.130608
C  0.158316 0.48155 2.122519
C  -2.71274 2.337607 -0.357007
C  3.294705 0.588134 1.541572
C  -1.834015 -4.436978 -0.201336
C  -2.127795 -0.125566 -3.742226
C  -3.96341 1.797002 0.305571
C  4.353833 1.172056 0.675231
C  -4.044284 1.711136 1.719108
C  -5.06539 1.358299 -0.47293
C  5.490092 1.740182 1.309605
C  4.256256 1.171476 -0.741484
C  -5.202615 1.195255 2.343694
C  -6.223998 0.841735 0.146997
C  -6.294341 0.758577 1.55831
C  6.521633 2.304116 0.532682
C  5.292484 1.737175 -1.513356
C  6.424471 2.303463 -0.879873
H  1.143574 -2.131705 0.027853
H  0.454756 -0.039038 -1.118059
H  1.547112 -1.177152 2.374243
H  -2.0514 -0.114602 0.715924
H  0.686605 1.213275 2.750333
H  -0.610467 -0.048133 2.724292
H  -2.94532 2.91758 -1.265156
H  -2.119851 2.957667 0.336197
H  -2.736788 -4.204277 0.378855
H  -1.772436 -5.493748 -0.497087
H  -1.670113 -3.735401 -1.030743
H  -3.023118 -0.757815 -3.672885
H  -1.926474 0.226139 -4.763831
H  -2.106782 0.662982 -2.974223
H  -3.197718 2.056026 2.32573
H  -5.014759 1.427261 -1.567058
H  5.543036 1.726636 2.403292
H  3.379203 0.730883 -1.223454
H  -5.254731 1.136158 3.436401
H  -7.072208 0.511972 -0.46335
H  -7.194519 0.361626 2.040656
H  7.398293 2.741246 1.02242
H  5.218651 1.73514 -2.605954
H  7.227495 2.740971 -1.483686
