program: Gaussian 09
title: 000298185
version: EM64L-G09RevD.01
frameworkgroup: C1[X(C12H2BrF8N)]
method: RPBEPBE
basis: SDD
operation: Freq
keyword: #p
keyword: freq=noraman
keyword: PBEPBE/SDD
title: #p freq=noraman PBEPBE/SDD
converged: YES YES NO NO
title: Mulliken charges:
elementType: Br F F F F F F F F N C C C C C C C C C C C C H H
charge: 0.156407 -0.163473 -0.155457 -0.159447 -0.167255 -0.147181 -0.148897 -0.168177 -0.166158 -0.488038 0.244263 0.250814 0.003041 0.131835 0.091200 -0.022126 0.419363 0.430853 -0.710556 0.304761 0.293534 -0.482632 0.355200 0.298124
chargesum: 0.00000
title: Mulliken charges with hydrogens summed into heavy atoms:
elementType: Br F F F F F F F F N C C C C C C C C C C C C
charge: 0.156407 -0.163473 -0.155457 -0.159447 -0.167255 -0.147181 -0.148897 -0.168177 -0.166158 -0.132838 0.244263 0.250814 0.003041 0.131835 0.091200 -0.022126 0.419363 0.430853 -0.710556 0.304761 0.293534 -0.184508
polarizability: 2.86059185e+02 1.18445847e-01 1.43280373e+02 -9.55476240e+00 6.19655413e-02 8.19283687e+01
1716.lowfreq: -2.5985 -0.9711 -0.0011 -0.0010 -0.0007 7.2051 26.4640 34.2541 44.7272
frequency: 26.4479 34.2497 44.7187 84.6548 115.3630 123.0665 128.6343 146.0311 158.4495 161.6345 192.5684 197.8297 234.9539 244.7083 262.1291 275.4900 278.2233 283.8664 298.6502 327.9978 332.6928 369.5428 381.3650 391.8119 416.5672 423.5155 464.0372 471.8056 507.8233 528.0580 572.4783 615.7048 622.3234 626.6615 628.5254 665.9829 679.3412 702.2204 738.5230 756.3786 787.6648 813.2367 884.3811 922.3054 1018.7312 1056.1578 1066.7110 1104.6037 1167.5705 1212.7647 1233.1518 1345.6206 1356.3070 1376.8128 1380.2591 1439.2971 1452.4047 1468.0696 1498.1210 1538.1101 1591.3620 1610.7675 1624.5558 1635.5646 3204.1600 3530.4045
redmass: 16.0709 16.8373 14.1496 16.1341 15.8242 18.4245 18.2161 21.1072 18.7772 17.7609 13.2253 13.8992 8.1576 8.4556 18.1101 18.5784 17.3931 18.0419 7.9277 7.4559 12.1092 12.6470 12.4228 12.7481 13.9028 15.2952 14.4383 15.6962 1.6202 4.1148 4.7063 8.7145 9.7688 11.8819 10.9990 6.3543 9.6941 6.6778 10.8392 11.0926 11.8612 1.5636 8.7883 12.4469 10.6420 10.9717 12.3028 9.0782 1.4244 11.6683 6.6052 5.9863 11.4184 11.9243 10.8210 5.0121 9.5270 4.8349 3.4727 5.2302 6.6103 5.6126 10.6758 11.5723 1.0938 1.0757
irintensity: 0.1709 0.0117 0.1590 1.3123 0.7109 0.1251 0.1530 0.3634 0.1704 0.4027 2.5422 0.8488 7.4166 6.7906 0.3809 0.9816 0.7756 1.0281 7.0413 2.6264 13.0867 1.8005 2.9209 1.2054 0.8197 0.1132 0.3109 2.4001 114.5502 38.9148 9.6901 38.9010 13.7551 3.1539 1.8172 18.1133 5.7100 2.4983 16.8592 10.1634 42.8060 43.0423 105.1951 107.9843 75.7284 0.7690 3.1698 131.4404 34.0965 11.7297 4.4229 54.9288 4.8575 23.6141 11.3446 114.9521 91.8684 173.2168 255.8674 342.2356 7.8783 17.6264 321.9361 64.2855 12.2787 80.2985
temp: 298.150 k
press: 1.00000 atm
elementType: 35 9 9 9 9 9 9 9 9 7 6 6 6 6 6 6 6 6 6 6 6 6 1 1
symmnumber: 1
zpe: 310036.9 jmol-1
zpe.correction: 0.118087 hartree
zpe.thermalcorrener: 0.137708 hartree
zpe.thermalcorrenthalpy: 0.138653 hartree
zpe.thermalcorrgfe: 0.068589 hartree
zpe.sumelectzpe: -1323.809975 hartree
zpe.sumelectthermal: -1323.790354 hartree
zpe.sumelectthermalent: -1323.789409 hartree
zpe.sumelectthermalfe: -1323.859473 hartree
dipole: 0.9941 0.9101 -0.0023
dipole: 1.3478
quadrupole: -127.5822 -137.8191 -133.4906
quadrupole: -1.2754 4.5602 -0.0541
quadrupole: 5.3818 -4.8551 -0.5267 -1.2754 4.5602 -0.0541
hfenergy: -1323.928062 hartree
pointgroup: C01 [X(C12H2Br1F8N1)]
dipole: -0.3625549 -0.3868929 0.007301 debye
dipolederiv: -0.4777581 -0.1550409 0.0192251 -0.2055836 0.0186273 0.0160342 0.0174117 0.0077624 0.09257 -0.2266603 -0.147599 0.0567465 -0.0582987 -0.7744182 0.3116604 0.0101378 0.3140438 -0.2341624 -0.6012561 0.2250574 -0.2388874 0.2314726 -0.3126217 0.2104752 -0.1678323 0.1910201 -0.2625205 -0.5783298 -0.2230228 -0.2727769 -0.1686648 -0.2674538 -0.1904849 -0.1582539 -0.1859477 -0.2790487 -0.1849031 0.0789325 0.0292515 -0.0894249 -0.7479528 -0.3370982 -0.0631066 -0.3267989 -0.2587137 -0.1925178 -0.097687 0.0453222 -0.1642494 -0.7047635 0.3182287 0.0926348 0.2998974 -0.2553359 -0.6141436 0.3447296 -0.2152822 0.3485077 -0.4147458 0.1897751 -0.2620235 0.1909141 -0.2175366 -0.8552389 -0.295136 -0.2544692 -0.3542606 -0.337867 -0.169433 -0.3380024 -0.1622385 -0.2442093 -0.2325376 0.0834492 0.0315825 0.2378835 -0.773125 -0.3573318 0.1261509 -0.3465547 -0.2999582 -2.1030705 0.0228172 0.0953003 0.0508351 -0.3274781 -0.0042942 0.0210317 0.0012769 -0.3638198 1.6220658 0.2411664 -0.1286407 0.7469934 0.0303529 -0.0137227 0.0505273 -0.0186303 0.1285452 1.5129745 -0.2933963 -0.1253034 -0.8835449 0.1135845 0.0466878 0.0479017 0.0296862 0.1274587 -0.2355142 0.1593803 -0.0527678 0.1284587 0.7990745 -0.3702091 0.0452637 -0.3324257 0.1534594 0.3571298 -0.3168246 0.3298384 -0.5717807 0.2295475 -0.1913254 0.2136518 -0.1979866 0.206721 0.3078092 0.3361614 0.3675555 0.5888566 0.1085406 0.1400827 0.2647902 0.1625615 0.2228104 -0.3941771 -0.044858 -0.0252742 0.0620526 0.77126 0.3890432 0.0806585 0.3539476 0.185183 0.1695492 0.12666 -0.0957207 0.0163836 0.8054927 -0.3549043 -0.0960059 -0.3040583 0.344648 0.5991635 -0.5253813 0.2672067 -0.3276092 0.4824932 -0.1867316 0.2407517 -0.2199853 0.3049645 0.6634912 0.3431155 -0.0393058 0.3679336 -0.1570871 0.0260126 -0.032037 0.0296396 -0.2606209 1.1505581 0.3222923 0.2874332 0.244042 0.4278311 0.2139542 0.3416063 0.2191798 0.2694569 0.5190915 -0.1654507 -0.0532046 -0.2733993 0.913742 0.4360237 -0.1536166 0.3998291 0.327059 -0.4050967 -0.0474027 -0.020597 0.0281994 -0.27742 -0.0775581 -0.0125243 -0.0729074 -0.2294073 0.1037945 0.0071976 0.0071891 0.0292892 0.2726134 -0.0025342 -0.2542103 0.0014499 0.3491991 0.0955766 0.0208398 -0.0144212 0.0159083 0.1217732 -0.0423502 -0.0149051 -0.0336749 0.193258 unknown
polarizability: 285.4071395|11.0889024|144.1393433|6.9384314|-0.077106|81.7214438 unknown
InChI: InChI=1S/C12H2BrF8N/c13-4-7(18)9(20)12(10(21)8(4)19)22-11-5(16)2(14)1-3(15)6(11)17/h1,22H
charge 0 multiplicity 1
24 atoms
Br 5.477909 1.068272 -0.243778
F  1.805628 -2.593429 1.014098
F  0.271513 1.375725 -1.289247
F  -0.63971 1.369134 1.36517
F  -2.547222 -2.349485 -1.081617
F  2.829299 2.368128 -1.304344
F  4.409807 -1.650794 0.90979
F  -5.063201 -1.150389 -0.926136
F  -3.114131 2.600263 1.42194
N  -0.31037 -1.160466 -0.009164
C  0.974701 -0.601678 -0.065824
C  -1.537262 -0.482432 0.070723
C  2.071158 -1.34307 0.442758
C  1.284189 0.639723 -0.674719
C  -1.722689 0.760144 0.729057
C  -2.697481 -1.101185 -0.463972
C  2.600076 1.134477 -0.708227
C  3.389727 -0.867753 0.384553
C  3.678649 0.393154 -0.181313
C  -3.960821 -0.49617 -0.378174
C  -2.989688 1.368993 0.780179
C  -4.128521 0.757266 0.233177
H  -0.359947 -2.182213 -0.028852
H  -5.108715 1.234884 0.287019
