program: Gaussian 09
title: 000298211
version: EM64L-G09RevD.01
frameworkgroup: C1[X(C16H4F6O8)]
method: RPBEPBE
basis: SDD
operation: Freq
keyword: #p
keyword: freq=noraman
keyword: PBEPBE/SDD
title: #p freq=noraman PBEPBE/SDD
converged: YES YES NO NO
title: Mulliken charges:
elementType: F F F F F F O O O O O O O O C C C C C C C C C C C C C C C C H H H H
charge: -0.137885 -0.137902 -0.135889 -0.135895 -0.137337 -0.137349 -0.409770 -0.409759 -0.386383 -0.386362 -0.183591 -0.183566 -0.209560 -0.209524 0.004620 0.004596 0.102846 0.102870 0.123436 0.123440 0.127882 0.127902 0.158732 0.158868 0.087536 0.087526 0.085934 0.085845 0.116401 0.116293 0.396432 0.396432 0.396592 0.396587
chargesum: 0.00000
title: Mulliken charges with hydrogens summed into heavy atoms:
elementType: F F F F F F O O O O O O O O C C C C C C C C C C C C C C C C
charge: -0.137885 -0.137902 -0.135889 -0.135895 -0.137337 -0.137349 -0.013338 -0.013326 0.010209 0.010226 -0.183591 -0.183566 -0.209560 -0.209524 0.004620 0.004596 0.102846 0.102870 0.123436 0.123440 0.127882 0.127902 0.158732 0.158868 0.087536 0.087526 0.085934 0.085845 0.116401 0.116293
polarizability: 3.18123490e+02 -5.56626468e-04 1.83584338e+02 4.82762239e+00 -1.04142622e-02 1.51302863e+02
1716.lowfreq: -3.9646 -2.2482 -1.4417 0.0007 0.0008 0.0008 15.7476 16.3662 26.8121
frequency: 15.7474 16.3608 26.8110 27.1861 34.4381 62.9555 65.3061 97.8763 100.5938 102.0584 102.6701 132.6802 137.9738 149.7340 153.2085 163.9639 164.5283 167.0817 183.2304 194.3727 282.0975 284.4248 284.6540 292.2581 293.3853 297.2495 301.5336 309.2637 310.6743 329.1096 380.3768 417.2136 421.1013 425.8932 444.6083 449.5420 464.7789 465.1460 540.5183 542.9972 544.1060 563.7983 569.7366 588.6346 613.1630 615.0532 621.7730 639.4946 645.7368 647.5491 684.8687 686.1763 701.3843 714.7870 719.6588 778.0462 792.8079 815.5109 823.7163 824.2976 879.3295 888.6704 908.0583 987.3027 1007.8805 1033.3025 1058.1260 1075.4794 1081.7455 1094.5807 1179.7763 1240.8359 1262.4292 1266.2084 1320.3231 1324.7900 1328.6023 1354.8056 1370.3642 1383.9158 1414.1864 1418.5117 1444.9103 1488.7251 1566.1358 1577.8528 1617.4847 1628.3564 1643.5805 1643.9836 1662.9946 1663.3147 3516.0722 3516.1240 3523.0320 3523.1053
redmass: 11.2222 11.8493 12.2111 10.7332 10.6235 11.6152 12.2815 10.9055 13.1760 11.0863 12.7693 10.0134 13.4819 13.2893 7.6928 13.0083 10.3885 10.1540 11.0757 9.9881 17.4043 14.1890 11.2190 13.7484 14.1346 11.1389 12.0553 12.0929 12.5463 11.4484 11.2996 10.1178 12.6990 8.0297 6.8384 14.4046 12.0550 13.8030 2.6645 2.2095 3.5235 2.4134 1.8177 3.3432 4.3164 4.6538 1.8937 2.6643 2.7612 2.8089 7.0312 10.3560 9.9351 9.2002 9.4931 12.1076 11.9872 9.7355 11.8530 11.6353 12.3977 12.7334 11.8691 10.4335 7.9565 6.1645 3.3043 3.1509 2.9850 2.8352 3.2443 4.3663 2.6874 2.5007 3.4259 3.6556 6.0585 9.3868 11.7227 10.1566 11.3489 11.4044 11.2066 11.8516 12.0204 12.0134 11.9989 11.9706 10.1103 10.1297 10.2855 10.2950 1.0643 1.0643 1.0642 1.0642
irintensity: 0.2947 0.3880 0.5989 1.0330 0.8037 0.1308 0.8404 0.4035 1.5528 0.5197 1.9145 2.3193 0.2354 0.0162 1.4728 0.0063 0.1211 0.5338 2.0951 1.4945 1.4375 0.4348 2.0014 0.3917 0.0105 0.5204 4.0915 0.4685 0.1961 1.0782 22.0766 4.1894 2.0177 10.0785 7.8873 0.0063 0.3742 10.0467 15.8796 0.6542 12.8902 115.8137 141.1953 69.3541 148.3546 26.9091 37.2354 201.0921 26.6894 59.0210 0.2582 13.7178 13.3411 2.6890 18.4416 40.4004 6.0327 1.8964 8.0618 2.5842 61.1999 46.3761 16.6893 3.3620 191.4854 14.3630 232.5942 628.3460 274.4330 16.8600 31.2003 1.3240 0.1818 8.0205 28.3483 95.0969 282.7433 61.4349 13.4572 92.6082 9.8993 111.1500 271.0881 16.3726 13.6103 23.3225 38.2616 25.3117 470.8192 16.2235 438.9823 32.3841 119.8960 5.1467 60.2686 55.3675
temp: 298.150 k
press: 1.00000 atm
elementType: 9 9 9 9 9 9 8 8 8 8 8 8 8 8 6 6 6 6 6 6 6 6 6 6 6 6 6 6 6 6 1 1 1 1
symmnumber: 1
zpe: 473247.5 jmol-1
zpe.correction: 0.180250 hartree
zpe.thermalcorrener: 0.207626 hartree
zpe.thermalcorrenthalpy: 0.208570 hartree
zpe.thermalcorrgfe: 0.119115 hartree
zpe.sumelectzpe: -1810.811639 hartree
zpe.sumelectthermal: -1810.784263 hartree
zpe.sumelectthermalent: -1810.783319 hartree
zpe.sumelectthermalfe: -1810.872774 hartree
dipole: 0.0000 1.1017 -0.0002
dipole: 1.1017
quadrupole: -123.8534 -163.9935 -184.4140
quadrupole: -0.0114 22.0165 0.0053
quadrupole: 33.5669 -6.5732 -26.9937 -0.0114 22.0165 0.0053
hfenergy: -1810.9918893 hartree
pointgroup: C01 [X(C16H4F6O8)]
dipole: 0.0000102 -0.0001333 -0.4334225 debye
polarizability: 317.7995576|8.7886081|151.6267982|-0.0005912|0.0141044|183.5843354 unknown
InChI: InChI=1S/C16H4F6O8/c17-7-1(9(19)11(21)5(15(27)28)3(7)13(23)24)2-8(18)4(14(25)26)6(16(29)30)12(22)10(2)20/h23,25,27,29H
charge 0 multiplicity 1
34 atoms
F  0.871738 -1.150203 -1.718301
F  -0.871645 1.150108 -1.718342
F  0.714603 1.280589 2.430242
F  -0.714542 -1.280587 2.430231
F  3.430503 1.460305 2.468094
F  -3.430415 -1.46015 2.4682
O  4.525767 -0.078834 -2.477512
O  -4.525525 0.078379 -2.477692
O  5.582018 1.579128 0.743178
O  -5.582106 -1.579129 0.7424
O  3.551175 -2.186271 -2.275658
O  -3.55194 2.186234 -2.275382
O  5.845648 -0.639177 0.095945
O  -5.845526 0.639719 0.096929
C  0.740575 0.054454 0.349941
C  -0.74052 -0.054435 0.349943
C  1.535452 -0.492006 -0.684559
C  -1.535397 0.492016 -0.684556
C  1.431398 0.713945 1.383904
C  -1.431338 -0.713958 1.383885
C  2.939098 -0.392285 -0.725792
C  -2.939041 0.392231 -0.725834
C  3.605167 0.292842 0.33167
C  -3.605126 -0.292802 0.331703
C  2.83524 0.833502 1.380795
C  -2.835181 -0.833491 1.380805
C  3.684705 -1.015361 -1.875833
C  -3.684607 1.015064 -1.876043
C  5.108189 0.331064 0.36887
C  -5.108153 -0.33077 0.369184
H  5.055246 -0.516744 -3.197904
H  -5.055374 0.516247 -3.197833
H  6.577115 1.564614 0.783943
H  -6.577201 -1.564542 0.78318
