program: Gaussian 09
title: 000298186
version: EM64L-G09RevD.01
frameworkgroup: C1[X(C14H5F8NO2)]
method: RPBEPBE
basis: SDD
operation: Freq
keyword: #p
keyword: freq=noraman
keyword: PBEPBE/SDD
title: #p freq=noraman PBEPBE/SDD
converged: YES YES NO NO
title: Mulliken charges:
elementType: F F F F F F F F O O N C C C C C C C C C C C C C C H H H H H
charge: -0.159018 -0.166526 -0.135930 -0.140586 -0.156829 -0.164723 -0.167562 -0.165505 -0.250662 -0.205140 -0.484406 0.240891 0.247081 0.118838 -0.030335 0.085282 0.101107 0.169493 0.093605 -0.022039 0.304079 0.292433 -0.480825 0.180149 -0.494199 0.356524 0.298411 0.241314 0.247585 0.247490
chargesum: 0.00000
title: Mulliken charges with hydrogens summed into heavy atoms:
elementType: F F F F F F F F O O N C C C C C C C C C C C C C C
charge: -0.159018 -0.166526 -0.135930 -0.140586 -0.156829 -0.164723 -0.167562 -0.165505 -0.250662 -0.205140 -0.127882 0.240891 0.247081 0.118838 -0.030335 0.085282 0.101107 0.169493 0.093605 -0.022039 0.304079 0.292433 -0.182414 0.180149 0.242191
polarizability: 3.08507524e+02 -2.98526201e+00 1.67597539e+02 -8.10246625e+00 -2.01383843e+00 9.50563264e+01
1716.lowfreq: -4.8394 -0.0004 0.0007 0.0008 2.7819 7.0194 25.1488 32.2413 39.6872
frequency: 25.1268 32.2157 39.6680 46.9243 68.6586 89.1192 100.1563 118.9979 121.1041 126.7835 154.5852 161.0478 176.9186 194.7236 207.9635 240.0990 245.1746 261.9171 272.3081 278.3892 280.5893 289.2432 299.9574 313.8669 331.0035 376.6798 382.4757 392.7148 416.4783 418.6325 423.9849 464.6463 474.0986 515.6084 529.0432 570.8099 607.3831 619.0317 628.7917 635.1145 665.7533 680.6329 685.6623 705.3235 709.4462 765.2807 788.1125 815.3332 835.7679 893.4218 912.1129 958.5870 1027.0446 1054.7066 1064.9563 1103.5662 1112.3196 1150.6234 1167.8997 1177.1011 1224.3881 1258.8375 1348.9676 1356.8806 1380.2180 1385.3610 1421.9286 1439.5548 1452.5446 1457.0555 1461.0129 1472.5120 1499.1846 1544.1581 1587.4356 1611.3548 1626.8918 1631.0630 1642.6817 3009.1549 3113.1219 3159.2868 3203.6224 3526.0197
redmass: 8.5325 9.8337 7.3433 8.5507 7.5030 1.5525 2.3561 12.9181 16.2195 14.4600 11.9730 13.4069 9.6738 12.7585 8.0129 5.2600 8.0330 17.6562 8.6410 15.8704 16.0475 17.0307 7.5596 5.8064 10.8444 12.6344 12.2272 11.3293 11.5834 11.7435 12.6755 14.3060 15.3035 2.3176 2.6012 4.2936 8.2180 8.5953 11.5491 11.9484 6.1740 8.9867 11.2412 6.9038 6.9515 10.0429 11.3348 1.5608 8.6166 8.8137 11.1405 10.9022 10.0846 11.2079 11.5791 8.2995 1.2641 1.4691 1.4626 7.9143 8.0462 8.5900 5.9184 10.4086 10.7279 10.2568 1.2179 5.6605 1.0524 5.3206 1.0664 6.1985 3.1638 6.9769 5.6025 5.6367 10.8175 10.6714 11.8075 1.0295 1.1049 1.1050 1.0938 1.0757
irintensity: 0.1568 0.5618 1.1046 1.6408 1.9662 1.2177 0.3933 1.1547 0.0126 0.8987 0.5399 0.0734 0.3032 1.8406 7.4959 11.5775 5.7382 0.1326 6.0576 1.9759 2.1785 1.8988 13.0437 6.9100 3.5836 4.1980 3.4967 1.0233 2.9133 11.8361 3.7578 0.3116 1.8261 65.4309 72.6526 28.3085 6.4217 48.6248 4.7952 1.9156 13.5257 5.8897 1.7198 15.3260 5.7551 14.8488 20.7073 43.3100 2.3514 98.6654 50.2305 148.4761 80.2582 6.6129 6.6546 64.2849 0.5489 21.8736 80.4286 354.3739 45.1710 209.1976 30.7337 38.9481 24.6872 24.2730 48.1408 110.1977 15.9836 106.8916 24.6209 116.6509 164.9472 359.4792 1.4887 17.5094 635.4174 142.6377 100.4237 32.4819 20.7994 11.0279 12.3071 85.6382
temp: 298.150 k
press: 1.00000 atm
elementType: 9 9 9 9 9 9 9 9 8 8 7 6 6 6 6 6 6 6 6 6 6 6 6 6 6 1 1 1 1 1
symmnumber: 1
zpe: 442731.5 jmol-1
zpe.correction: 0.168628 hartree
zpe.thermalcorrener: 0.191610 hartree
zpe.thermalcorrenthalpy: 0.192554 hartree
zpe.thermalcorrgfe: 0.115074 hartree
zpe.sumelectzpe: -1538.585035 hartree
zpe.sumelectthermal: -1538.562052 hartree
zpe.sumelectthermalent: -1538.561108 hartree
zpe.sumelectthermalfe: -1538.638588 hartree
dipole: 0.8325 -1.1207 0.4595
dipole: 1.4697
quadrupole: -129.3397 -144.6499 -140.7792
quadrupole: 12.7854 1.9329 1.0868
quadrupole: 8.9166 -6.3936 -2.5229 12.7854 1.9329 1.0868
hfenergy: -1538.7536624 hartree
pointgroup: C01 [X(C14H5F8N1O2)]
dipole: 0.3263151 -0.445891 0.1704373 debye
polarizability: 308.8463098|-1.4348995|167.5949629|-1.6931966|1.2042565|94.7201171 unknown
InChI: InChI=1S/C14H5F8NO2/c1-25-14(24)5-8(19)10(21)13(11(22)9(5)20)23-12-6(17)3(15)2-4(16)7(12)18/h2,23H,1H3
charge 0 multiplicity 1
30 atoms
F  0.333953 -1.125313 -1.374028
F  -0.805666 2.868971 1.102331
F  -3.481608 2.245607 0.892678
F  -2.292483 -1.796378 -1.545017
F  1.198973 -1.371511 1.27493
F  3.521935 2.255846 -0.936172
F  5.888127 0.777957 -0.857485
F  3.522351 -2.872494 1.253241
O  -4.695529 -1.462544 -0.206994
O  -5.333215 0.72263 -0.719397
N  1.158131 1.25607 0.066654
C  -0.175616 0.852455 -0.060049
C  2.304638 0.443283 0.09718
C  -0.607743 -0.314363 -0.738058
C  -1.198325 1.693096 0.450112
C  -2.986447 0.184748 -0.307398
C  -2.557075 1.37843 0.324633
C  -1.969203 -0.646174 -0.833527
C  2.346235 -0.850398 0.676722
C  3.52836 0.963577 -0.397854
C  4.716654 0.217507 -0.35079
C  3.537778 -1.597785 0.68944
C  4.740347 -1.082198 0.180934
C  -4.448627 -0.117259 -0.445238
C  -6.110735 -1.888266 -0.358769
H  1.315852 2.264036 0.148273
H  5.661574 -1.667668 0.204034
H  -6.09896 -2.965073 -0.14378
H  -6.457558 -1.688115 -1.386148
H  -6.748315 -1.342175 0.356043
