program: Gaussian 09
title: 000298891
version: EM64L-G09RevD.01
frameworkgroup: C1[X(C30H20Cl4)]
method: RPBEPBE
basis: SDD
operation: Freq
keyword: #p
keyword: freq=noraman
keyword: PBEPBE/SDD
title: #p freq=noraman PBEPBE/SDD
converged: YES YES NO NO
title: Mulliken charges:
elementType: Cl Cl Cl Cl C C C C C C C C C C C C C C C C C C C C C C C C C C C C C C H H H H H H H H H H H H H H H H H H H H
charge: -0.001306 -0.001322 -0.017357 -0.017353 -0.500705 -0.500680 0.423687 -0.278911 -0.278905 0.453215 0.651089 0.651086 0.527270 0.527262 -0.672921 -0.672941 -0.217060 -0.217106 -0.431158 -0.431157 -0.363627 -0.363617 -0.368161 -0.368089 -0.256784 -0.256783 -0.205633 -0.205632 -0.240632 -0.240639 -0.240245 -0.240263 -0.246622 -0.246615 0.277023 0.277021 0.259841 0.259859 0.258442 0.258444 0.246606 0.246590 0.244838 0.244823 0.228746 0.228744 0.226281 0.226280 0.227751 0.227752 0.225608 0.225610 0.229178 0.229178
chargesum: 0.00000
title: Mulliken charges with hydrogens summed into heavy atoms:
elementType: Cl Cl Cl Cl C C C C C C C C C C C C C C C C C C C C C C C C C C C C C C
charge: -0.001306 -0.001322 -0.017357 -0.017353 -0.500705 -0.500680 0.423687 -0.001888 -0.001884 0.453215 0.651089 0.651086 0.527270 0.527262 -0.672921 -0.672941 0.042781 0.042753 -0.172716 -0.172713 -0.117022 -0.117027 -0.123323 -0.123265 -0.028038 -0.028038 0.020648 0.020648 -0.012881 -0.012887 -0.014636 -0.014654 -0.017444 -0.017437
polarizability: 4.69205437e+02 3.01613084e-04 3.51501974e+02 -3.03550048e+01 -7.31748796e-04 3.10994262e+02
1716.lowfreq: -5.4515 -3.7460 0.0019 0.0022 0.0024 7.4957 22.0685 30.9097 40.1530
frequency: 21.9722 30.8986 40.1253 49.3671 50.1957 55.2401 60.7824 76.4214 90.7225 112.1756 127.1374 127.8299 145.4096 164.2138 177.0260 181.2671 189.8323 198.6919 210.2061 219.3731 219.7784 243.1828 246.7579 261.1975 268.5530 295.7341 313.6178 320.7234 341.2844 378.6304 389.2201 404.1603 404.5158 415.4142 423.2185 443.7960 456.1864 492.3185 505.4918 519.2236 538.0860 541.8434 570.8058 572.4265 599.4349 613.3242 613.3910 614.7076 620.5199 626.5118 660.1532 690.1283 698.1244 700.1812 721.7434 725.6246 739.6900 743.2205 769.8365 771.3399 788.1669 793.7147 812.7011 828.5837 828.8726 848.2629 848.3215 861.3582 881.1139 904.3474 922.9923 924.8385 925.7845 931.5709 974.2375 974.3486 977.3815 977.4596 982.8051 985.9601 989.7663 989.8282 992.9260 992.9997 995.3396 995.4348 1012.9008 1018.5066 1028.6168 1035.5778 1064.4593 1064.8809 1089.7039 1089.8968 1113.2367 1154.6783 1158.5180 1163.7919 1165.8955 1172.9165 1173.3545 1177.7835 1185.7664 1186.9861 1196.6502 1196.8310 1251.4867 1261.2298 1270.1955 1275.4251 1294.1148 1307.3284 1308.2760 1317.4460 1317.8817 1364.0174 1368.4620 1376.5480 1376.7330 1418.5420 1422.0894 1432.0050 1432.0087 1468.5581 1476.7271 1476.8869 1552.3959 1567.1743 1581.4892 1585.2776 1587.3469 1588.4241 1607.6360 1607.7030 1645.9490 1648.2136 2902.9070 2903.3637 3125.4088 3125.4143 3130.3273 3130.3406 3135.5132 3135.5309 3143.0617 3143.0809 3150.6735 3150.7091 3159.7911 3159.8087 3161.8736 3161.9019 3169.5162 3169.5253 3171.0271 3171.2037
redmass: 6.1448 4.9070 5.5795 4.3862 5.0658 5.6446 6.4684 10.0606 4.7588 4.3353 6.1525 7.6862 7.9582 6.6399 8.7439 24.7409 12.9339 8.4513 8.6636 7.7864 6.9729 6.0397 5.0057 6.9177 5.4114 6.4008 9.0331 10.4163 7.1879 4.2394 6.1714 2.8474 2.9249 5.8474 4.2426 3.5657 4.0330 4.6397 3.5951 4.0395 3.8568 7.0545 6.3150 4.8471 6.5570 5.8627 6.1369 6.2417 5.9207 7.2815 9.1510 5.3747 2.0642 1.7677 2.3245 3.1707 1.7259 1.5429 3.8431 2.4038 3.2663 3.8219 3.6153 1.7436 1.8023 1.2697 1.2675 4.0655 4.6035 3.3764 3.7125 1.5807 3.5813 2.3394 1.3833 1.3861 1.3519 1.3595 2.3830 2.2946 4.4178 4.4390 1.4069 1.3953 1.3570 1.3490 5.0620 3.5248 2.4402 2.3598 4.2243 2.3756 1.6389 1.7503 2.9937 2.4609 1.8522 1.3012 1.3558 1.1141 1.0529 2.0163 1.1417 1.3390 1.1162 1.1238 1.5180 1.6112 1.8826 1.5876 3.5609 2.6430 2.4119 1.3677 1.3681 1.5610 1.6548 7.6753 7.4854 2.0608 2.1643 2.2438 2.2443 11.0083 2.1682 2.1692 8.3979 8.4547 8.9952 7.8839 6.0492 6.6970 6.1170 6.1188 6.3127 6.4650 1.0792 1.0793 1.0847 1.0847 1.0850 1.0850 1.0886 1.0886 1.0870 1.0870 1.0929 1.0928 1.0955 1.0955 1.0957 1.0957 1.1001 1.1001 1.0995 1.0996
irintensity: 0.4270 0.1382 0.0101 0.3649 0.0225 0.2219 0.5691 0.1856 0.9605 0.7630 0.0813 0.6943 0.9618 0.0253 0.1506 0.1457 1.7569 0.6336 0.6148 0.7077 5.1253 0.5718 0.0083 0.3832 1.0868 1.8136 6.3170 1.9295 0.8349 3.2637 6.3480 0.2012 0.0614 4.5066 0.7284 2.3879 21.8071 0.8288 1.3335 6.4842 6.4680 0.4672 45.1020 44.0264 7.7460 1.1856 9.2271 0.0560 32.6606 16.9688 13.4063 0.2338 25.6873 42.6836 14.2179 47.5622 50.5435 33.7605 53.2821 5.3125 51.7832 17.5630 0.3479 5.8071 11.1130 0.9541 1.1801 49.6276 21.6701 8.2402 1.3757 1.3057 15.9636 0.1987 0.1744 0.1710 0.0105 1.6424 10.9347 0.0250 2.2654 0.9817 1.0720 0.5181 0.0108 0.0704 3.3151 18.5003 10.9139 12.2844 4.3418 3.2383 4.3980 22.6136 48.2032 17.0852 0.1027 1.4976 2.3809 1.0519 0.0530 9.4257 1.2337 2.6665 3.1590 5.8394 0.0003 60.9316 48.2558 38.1311 64.7553 2.0608 1.5842 7.4279 5.4725 15.6369 28.8998 1.5303 0.1430 1.5550 0.7445 19.4842 13.3265 0.1664 2.5805 21.6388 48.2617 0.0720 13.1577 5.2735 0.1526 1.9294 1.3123 1.3139 2.5142 10.6243 14.1239 1.2041 0.2827 0.5751 8.8379 9.0743 11.2924 7.5023 8.5615 0.7771 48.0383 18.2833 4.3155 0.0937 19.9618 21.1980 25.3193 5.1591 64.0772 0.9431
temp: 298.150 k
press: 1.00000 atm
elementType: 17 17 17 17 6 6 6 6 6 6 6 6 6 6 6 6 6 6 6 6 6 6 6 6 6 6 6 6 6 6 6 6 6 6 1 1 1 1 1 1 1 1 1 1 1 1 1 1 1 1 1 1 1 1
symmnumber: 1
zpe: 1045964.5 jmol-1
zpe.correction: 0.398387 hartree
zpe.thermalcorrener: 0.427251 hartree
zpe.thermalcorrenthalpy: 0.428195 hartree
zpe.thermalcorrgfe: 0.338511 hartree
zpe.sumelectzpe: -2993.023346 hartree
zpe.sumelectthermal: -2992.994481 hartree
zpe.sumelectthermalent: -2992.993537 hartree
zpe.sumelectthermalfe: -2993.083222 hartree
dipole: -0.0002 -0.8059 0.0002
dipole: 0.8059
quadrupole: -191.8750 -228.7149 -213.2432
quadrupole: 0.0008 -4.0435 -0.0005
quadrupole: 19.4027 -17.4372 -1.9655 0.0008 -4.0435 -0.0005
hfenergy: -2993.4217325 hartree
pointgroup: C01 [X(C30H20Cl4)]
dipole: 0.0000139 0.3170532 0.0002935 debye
polarizability: 470.8389094|0.0016141|351.5019519|25.6967779|0.0325588|309.3608118 unknown
InChI: InChI=1S/C30H20Cl4/c31-26-21-15-7-9-17-23(21)29(33,19-11-3-1-4-12-19)28-25(26)27(32)22-16-8-10-18-24(22)30(28,34)20-13-5-2-6-14-20/h1-18,23-24H
charge 0 multiplicity 1
54 atoms
Cl -0.790564 2.220814 -1.47134
Cl 0.789748 2.219196 1.473377
Cl -1.462534 -3.740166 0.739921
Cl 1.463689 -3.738804 -0.745355
C  -1.298879 0.682577 -0.393838
C  1.298637 0.682444 0.393984
C  0.000001 -0.048036 -0.000428
C  -2.093238 -0.212302 -1.419402
C  2.093151 -0.213501 1.418505
C  0.000218 -1.447551 -0.001323
C  -2.355452 -1.597612 -0.80292
C  2.355876 -1.597918 0.800241
C  -2.162982 1.149209 0.785377
C  2.16273 1.150809 -0.784536
C  -1.275949 -2.160037 -0.16504
C  1.276602 -2.159843 0.161531
C  -3.331101 0.437838 -2.005648
C  3.330723 0.436247 2.005787
C  -3.660817 -2.213448 -0.93044
C  3.661418 -2.213511 0.927111
C  -2.147875 0.406348 1.99481
C  2.147628 0.40979 -1.995094
C  -3.063865 2.237317 0.670131
C  3.063668 2.238701 -0.6676
C  -4.528992 -0.212495 -2.097555
C  4.528805 -0.213834 2.0970
C  -4.700704 -1.56009 -1.555646
C  4.701018 -1.560649 1.553313
C  -3.009019 0.745273 3.060438
C  3.008811 0.750303 -3.060184
C  -3.920409 2.579868 1.737907
C  3.92026 2.582837 -1.734824
C  -3.899839 1.834534 2.938835
C  3.899676 1.839339 -2.936894
H  -1.376601 -0.351222 -2.263539
H  1.376437 -0.353734 2.262361
H  -3.197843 1.442379 -2.419617
H  3.197072 1.440173 2.421116
H  -3.800099 -3.212692 -0.506386
H  3.801068 -3.212151 0.501757
H  -1.457017 -0.433795 2.11332
H  1.456729 -0.430137 -2.114892
H  -3.067848 2.839306 -0.242962
H  3.067653 2.83929 0.246416
H  -5.384492 0.277753 -2.575402
H  5.384078 0.276036 2.575639
H  -5.680137 -2.044131 -1.63944
H  5.680594 -2.044491 1.636594
H  -2.978661 0.159783 3.986113
H  2.978453 0.166231 -3.986754
H  -4.59884 3.434011 1.633327
H  4.598736 3.436781 -1.628921
H  -4.562945 2.103113 3.768713
H  4.562818 2.109151 -3.766344
