program: Gaussian 09
title: 000298160
version: EM64L-G09RevD.01
frameworkgroup: C1[X(C21H20N4O2)]
method: RPBEPBE
basis: SDD
operation: Freq
keyword: #p
keyword: freq=noraman
keyword: PBEPBE/SDD
title: #p freq=noraman PBEPBE/SDD
converged: YES YES NO NO
title: Mulliken charges:
elementType: O O N N N N C C C C C C C C C C C C C C C C C C C C C H H H H H H H H H H H H H H H H H H H H
charge: -0.258331 -0.258412 -0.117396 -0.071867 -0.071947 -0.154295 -0.451250 -0.451290 0.099131 -0.013911 -0.013863 0.042252 0.042034 0.380316 0.380725 -0.555893 -0.555926 -0.308758 -0.389627 -0.309128 -0.389504 -0.216715 -0.199102 -0.216543 -0.199060 -0.249754 -0.249721 0.214333 0.264957 0.214336 0.265007 0.213372 0.213372 0.215554 0.231635 0.215556 0.231613 0.288183 0.260782 0.287655 0.260767 0.230072 0.230534 0.230084 0.230544 0.229727 0.229754
chargesum: 0.00000
title: Mulliken charges with hydrogens summed into heavy atoms:
elementType: O O N N N N C C C C C C C C C C C C C C C C C C C C C
charge: -0.258331 -0.258412 -0.117396 -0.071867 -0.071947 -0.154295 0.028040 0.028052 0.099131 0.199461 0.199508 0.042252 0.042034 0.380316 0.380725 -0.108704 -0.108757 -0.020575 -0.128844 -0.021473 -0.128738 0.013357 0.031431 0.013541 0.031484 -0.020027 -0.019967
polarizability: 3.69942690e+02 -2.37108211e-02 2.86644669e+02 2.53540338e-02 2.15260567e+01 1.69646716e+02
1716.lowfreq: -6.4280 -2.3133 -0.0007 -0.0006 0.0002 2.2679 14.6738 18.5602 22.0477
frequency: 13.9259 18.5601 21.9210 23.4983 32.5267 37.0719 41.0681 55.9853 68.8883 82.1408 91.2524 105.0171 147.0571 175.1245 181.6129 190.2218 200.9535 237.4644 243.1426 256.5269 292.7623 302.4420 338.0504 359.7282 394.9295 406.0703 407.1170 412.5314 434.8337 484.1154 485.3257 510.8494 521.6608 580.6090 590.7948 599.3679 612.6020 632.2423 660.5379 668.8328 679.1811 684.8921 691.0468 691.6867 708.4455 758.0298 761.8219 778.6934 782.7150 801.0648 829.1195 835.0804 864.4586 895.7861 907.1592 910.5545 911.1355 928.3718 937.2991 944.5315 959.7932 961.0229 965.8569 967.4941 986.5886 987.4474 988.4831 988.9458 993.9496 994.6327 1002.9532 1022.0748 1023.9432 1063.0590 1079.3905 1080.1803 1105.3524 1153.1026 1161.1600 1169.2233 1169.6318 1178.0661 1178.3055 1186.9151 1194.9295 1248.1991 1270.8720 1271.2521 1288.3312 1289.4529 1309.4392 1309.8160 1325.4696 1338.6442 1344.2816 1349.2935 1384.3444 1385.9247 1413.2316 1426.8100 1427.7084 1440.7635 1442.2253 1450.8597 1453.0024 1468.3474 1471.0036 1505.6223 1563.1301 1594.6098 1595.4369 1606.3151 1607.7318 1659.8223 1660.0988 2988.1873 2993.2013 3079.9521 3080.5587 3095.5221 3095.7843 3105.9499 3106.9458 3131.6501 3131.8607 3143.2098 3143.5101 3160.3900 3160.5672 3174.3039 3174.3711 3202.4672 3202.5227 3204.3868 3204.7658
redmass: 3.8497 4.8519 4.3959 4.4986 3.8530 5.2070 5.0014 3.4513 5.6127 2.2947 3.4421 3.8213 4.4031 5.2675 6.0709 7.0847 6.3344 3.5705 5.5110 3.0404 4.3346 5.8707 3.1519 5.6982 2.1501 2.7812 2.8797 2.7021 3.0127 3.3941 3.2605 3.7115 2.0333 7.2842 8.3799 5.8320 6.7649 5.2157 2.9817 3.8523 5.6760 3.3939 2.3430 3.5625 3.6292 1.6612 1.5700 10.9533 5.2201 7.0386 1.2495 1.2455 2.3005 11.9508 1.4142 1.4019 1.4371 2.2765 2.4786 2.1131 1.3327 1.4192 1.3765 1.3740 2.3970 2.2944 1.9621 2.0208 1.1724 1.1467 9.0178 2.1264 2.1014 2.6437 1.5166 1.5199 2.0427 3.0384 1.9389 1.0865 1.1125 1.7639 1.8051 1.9351 2.0360 6.1197 1.8330 1.4338 1.3253 1.2461 1.4354 1.3333 5.6389 1.2042 1.4773 2.6707 9.6602 8.8547 8.2130 1.1627 1.1698 2.2963 2.2656 1.1735 1.1198 2.3831 2.3006 7.6636 5.1399 6.4497 6.4131 6.5895 6.5835 4.6856 4.6851 1.0667 1.0669 1.0781 1.0778 1.0778 1.0765 1.0924 1.0947 1.0853 1.0853 1.0904 1.0904 1.0954 1.0954 1.0988 1.0988 1.1152 1.1152 1.0948 1.0947
irintensity: 0.0034 0.0624 0.0644 0.9164 0.0371 1.1975 0.0001 0.0425 0.2901 0.2146 1.5914 0.7957 0.4464 0.7517 0.3564 1.1765 0.6020 0.1490 0.0056 0.0281 3.0472 0.0790 3.1514 3.9073 6.8122 1.7802 0.1896 5.0417 5.6280 0.5939 13.8295 13.7929 4.2977 8.5550 7.1929 0.0054 5.9334 5.4607 1.8124 5.2081 14.3899 37.9010 2.7357 38.0128 9.1109 146.0494 1.1246 31.0915 71.6044 5.2294 1.3327 0.9452 2.8598 0.0013 5.2025 0.0918 41.2339 18.5048 6.7116 0.4862 50.3884 141.3335 0.0903 0.0084 5.8468 1.6556 7.3117 1.5185 13.0011 28.5422 30.9952 17.5269 24.3220 100.9360 19.7462 8.2172 13.3583 39.6116 213.3144 0.4318 15.6829 65.4616 0.0437 163.9362 132.2853 382.7414 360.2134 6.0900 2.4981 11.2447 32.7437 0.8180 269.1208 4.7282 76.6770 568.8373 40.5026 46.8011 635.0852 16.5329 2.3166 69.2430 1.8640 3.3243 16.0948 624.6121 4.1854 640.6512 655.1458 2.4185 22.2744 12.2754 1.0281 0.7028 9.2114 29.3535 68.7572 19.0020 12.4392 14.3123 2.0177 9.3930 5.5376 0.0866 0.0163 33.5749 0.1463 3.2654 52.9610 16.2434 5.8264 29.6992 18.7649 0.8392 0.4281
temp: 298.150 k
press: 1.00000 atm
elementType: 8 8 7 7 7 7 6 6 6 6 6 6 6 6 6 6 6 6 6 6 6 6 6 6 6 6 6 1 1 1 1 1 1 1 1 1 1 1 1 1 1 1 1 1 1 1 1
symmnumber: 1
zpe: 958598.1 jmol-1
zpe.correction: 0.365111 hartree
zpe.thermalcorrener: 0.390003 hartree
zpe.thermalcorrenthalpy: 0.390948 hartree
zpe.thermalcorrgfe: 0.304705 hartree
zpe.sumelectzpe: -1179.708614 hartree
zpe.sumelectthermal: -1179.683721 hartree
zpe.sumelectthermalent: -1179.682777 hartree
zpe.sumelectthermalfe: -1179.769019 hartree
dipole: -0.2899 -0.0017 0.0051
dipole: 0.2900
quadrupole: -125.4878 -154.3302 -153.0187
quadrupole: -0.0260 0.0012 6.7076
quadrupole: 18.7911 -10.0513 -8.7398 -0.0260 0.0012 6.7076
hfenergy: -1180.0737244 hartree
pointgroup: C01 [X(C21H20N4O2)]
dipole: -0.1140737 -0.0009279 0.0017127 debye
polarizability: 369.9419013|-0.2786862|267.7556734|0.2077644|48.1308027|188.5365001 unknown
InChI: InChI=1S/C21H20N4O2/c1-3-15-25(16-4-2)19-22-20(26-17-11-7-5-8-12-17)24-21(23-19)27-18-13-9-6-10-14-18/h3-14H,1-2,15-16H2
charge 0 multiplicity 1
47 atoms
O  0.30786 2.220399 0.843313
O  0.298914 -2.220128 -0.848745
N  -3.681555 0.008418 -0.003043
N  -1.667696 -1.146862 -0.415056
N  -1.662954 1.155476 0.40868
N  0.429146 -0.00016 -0.002749
C  -4.443038 -1.211219 -0.379841
C  -4.438049 1.230881 0.374572
C  -2.311933 0.00578 -0.003525
C  -4.85528 -2.025315 0.836128
C  -4.848448 2.046542 -0.840976
C  -0.31688 1.074008 0.386914
C  -0.321338 -1.071119 -0.392673
C  1.724049 2.416335 0.893107
C  1.714392 -2.421978 -0.895193
C  -4.461154 -3.303257 1.054183
C  -4.45032 3.323224 -1.059128
C  2.637563 1.937819 -0.071782
C  2.140131 3.249981 1.953709
C  2.626346 -1.952708 0.075675
C  2.130713 -3.251746 -1.958691
C  3.998585 2.299455 0.053772
C  3.502631 3.602029 2.062035
C  3.986246 -2.319534 -0.046753
C  3.492092 -3.609137 -2.063863
C  4.438048 3.126255 1.113089
C  4.426013 -3.142528 -1.108931
H  -5.336473 -0.882142 -0.945874
H  -3.809881 -1.819523 -1.043365
H  -5.332179 0.905201 0.941479
H  -3.801955 1.836774 1.037497
H  -5.509765 -1.523933 1.565388
H  -5.505109 1.547417 -1.569829
H  -4.783794 -3.860329 1.941213
H  -3.7940 -3.821338 0.355173
H  -4.771822 3.881484 -1.945823
H  -3.780954 3.839033 -0.360555
H  2.305834 1.284097 -0.878977
H  1.394234 3.610439 2.668151
H  2.294434 -1.302062 0.88531
H  1.385924 -3.605129 -2.677805
H  4.715115 1.928815 -0.687532
H  3.829724 4.247612 2.88423
H  4.701641 -1.956059 0.699175
H  3.819459 -4.251736 -2.888282
H  5.495357 3.399518 1.19659
H  5.48243 -3.419949 -1.189994
