program: Gaussian 09
title: 000298114
version: EM64L-G09RevD.01
frameworkgroup: C1[X(C6H14N2O2)]
method: RPBEPBE
basis: SDD
operation: Freq
keyword: #p
keyword: freq=noraman
keyword: PBEPBE/SDD
title: #p freq=noraman PBEPBE/SDD
converged: YES YES NO NO
title: Mulliken charges:
elementType: O O N N C C C C C C H H H H H H H H H H H H H H
charge: -0.458011 -0.293684 -0.276753 -0.373588 -0.031869 -0.672956 -0.706938 -0.119654 0.172713 -0.661034 0.233228 0.294609 0.212770 0.221294 0.215642 0.219206 0.219228 0.225875 0.221407 0.319545 0.232767 0.252467 0.188074 0.365663
chargesum: 0.00000
title: Mulliken charges with hydrogens summed into heavy atoms:
elementType: O O N N C C C C C C
charge: -0.092348 -0.293684 0.017856 -0.054042 0.201359 -0.023250 -0.042629 0.101753 0.172713 0.012273
polarizability: 1.08536907e+02 -8.90535549e-01 8.50385554e+01 2.28466512e+00 -5.81366226e-01 6.97977757e+01
1716.lowfreq: -8.5122 -5.3604 -0.0010 -0.0003 0.0005 9.4951 22.9166 53.3919 65.0669
frequency: 20.7147 53.0080 64.9334 70.4555 185.5976 195.2299 206.6305 223.0235 240.4974 307.9057 322.1511 345.4378 382.9459 416.1904 440.2587 461.2554 541.3681 565.1026 639.5877 694.6444 721.9459 835.3551 861.0521 912.4265 922.5916 949.9648 962.8779 1020.4082 1052.6816 1084.8452 1113.2280 1140.1965 1168.2424 1188.4253 1223.6292 1251.9046 1315.2412 1327.1394 1340.6130 1373.3961 1377.0222 1388.9713 1393.5592 1442.1251 1457.4484 1462.5363 1468.5141 1473.3256 1476.0110 1489.3770 1503.0466 1597.7061 2950.2535 2973.6643 2980.2328 2983.1067 2984.9569 3074.3692 3079.2107 3082.6586 3086.8323 3095.4978 3106.5806 3385.9842 3389.8448 3552.5909
redmass: 3.6784 3.3324 3.4904 5.0229 3.0416 1.7207 1.0500 1.5054 1.1608 2.5193 3.7165 3.9707 3.2178 2.5038 2.2380 1.2049 1.5806 2.4762 3.0162 2.0238 3.4538 2.3566 3.1699 2.7600 1.2247 1.3798 1.8827 2.0129 3.2772 2.7584 1.9400 2.2325 2.0362 1.9362 1.3941 2.1591 1.2386 1.3121 1.3995 1.2748 1.2911 1.2062 1.2275 1.4198 1.0876 1.1469 1.0460 1.0546 1.0681 1.0677 1.1885 6.1577 1.0841 1.0819 1.0354 1.0364 1.0388 1.0995 1.0988 1.0976 1.1005 1.0995 1.1009 1.0736 1.0645 1.0791
irintensity: 2.2613 0.9473 1.0977 2.0803 1.8260 1.2156 0.1905 1.9426 0.0956 4.5343 15.6860 28.3930 13.1069 43.0457 6.6933 62.9438 100.9970 50.8963 8.3425 50.4133 5.4184 16.4193 21.5019 1.1956 2.4349 3.2681 4.8513 66.9270 43.6663 18.9174 27.5791 24.3580 0.4415 19.1407 4.4613 63.1973 2.6476 19.3734 40.4770 139.9773 60.3880 14.4103 20.3101 33.0682 30.0483 5.1960 0.8550 4.3303 34.5856 23.5362 14.5993 108.5050 27.7876 34.6518 37.8114 11.5061 23.5028 21.9969 50.7728 35.3262 12.1945 50.5254 20.8462 0.1867 57.6643 27.1337
temp: 298.150 k
press: 1.00000 atm
elementType: 8 8 7 7 6 6 6 6 6 6 1 1 1 1 1 1 1 1 1 1 1 1 1 1
symmnumber: 1
zpe: 534721.9 jmol-1
zpe.correction: 0.203665 hartree
zpe.thermalcorrener: 0.216229 hartree
zpe.thermalcorrenthalpy: 0.217173 hartree
zpe.thermalcorrgfe: 0.163915 hartree
zpe.sumelectzpe: -496.135660 hartree
zpe.sumelectthermal: -496.123096 hartree
zpe.sumelectthermalent: -496.122152 hartree
zpe.sumelectthermalfe: -496.175409 hartree
dipole: -2.4300 -2.6636 -0.6983
dipole: 3.6725
quadrupole: -67.0039 -61.6505 -63.0744
quadrupole: -6.5209 -5.5678 -1.8750
quadrupole: -3.0943 2.2591 0.8352 -6.5209 -5.5678 -1.8750
hfenergy: -496.3393248 hartree
pointgroup: C01 [X(C6H14N2O2)]
dipole: -0.8466008 -0.7848119 -0.8689262 debye
dipolederiv: -0.5707141 -0.1622533 -0.0718219 -0.0519773 -0.4359536 -0.0912294 -0.005414 -0.1343338 -0.7179819 -0.6420763 0.1302618 -0.025579 -0.1831633 -0.8146337 -0.3539484 -0.2485582 -0.1816018 -0.5232346 -0.1848859 -0.0499967 0.004095 -0.0808457 -0.1495159 -0.1294113 0.0808649 0.0087778 -0.4010321 -0.6472701 -0.2549348 -0.1023167 -0.4868617 -0.3131225 -0.0782698 -0.2477593 -0.072572 -0.4392707 0.5013274 0.078108 -0.1087551 0.1958328 0.2696937 0.0262877 -0.1584455 -0.0258918 0.2977161 -0.0022232 -0.0179397 0.0129715 -0.0430922 -0.1249742 0.033265 0.0436477 0.0202099 0.0739815 -0.1107063 0.0459574 -0.0105348 0.0602609 -0.0071513 0.0234965 0.0566605 0.0452854 0.0701451 0.108551 0.1860066 -0.0327109 0.2079323 0.3368276 0.0995476 0.0172258 0.0933888 0.540539 0.8822815 0.0055266 0.2458666 0.3173678 0.8521316 0.5096478 0.5501239 0.4023997 0.4987679 -0.0609179 0.0395744 0.0993547 0.0422804 0.0550396 0.0133976 -0.0244046 0.0109567 -0.1010713 -0.0280882 -0.0256536 -0.0693253 -0.0207304 -0.0084495 -0.0496567 0.0184923 -0.0333732 -0.1603432 0.0759291 -0.0612873 0.0255889 -0.0267046 0.0120477 0.0484991 0.023659 -0.0830748 0.2685354 -0.0653891 -0.0546683 0.1216977 -0.022271 0.0804991 -0.0027497 0.1448043 0.0298418 -0.0141114 0.0712175 -0.0356086 -0.060833 -0.0174122 0.0563886 -0.0260115 -0.1030517 -0.0940088 -0.103819 -0.0441549 0.1513055 -0.0628706 0.1207833 -0.0256098 0.0415904 -0.0670815 0.0279699 0.0706001 0.0701546 -0.0884592 -0.0049887 -0.0400614 -0.1634321 0.0180291 -0.0200163 0.0150886 0.0912981 -0.0873044 -0.003838 0.0925228 -0.0190426 0.0998175 0.0381124 0.1294447 0.0128312 0.0026743 0.0852988 0.0074998 -0.0425271 -0.023197 0.0666249 -0.080284 -0.1085833 -0.0289829 -0.1087158 -0.0066753 -0.0802083 0.0111405 -0.0754644 -0.1482719 0.0251163 0.0164796 0.0410448 -0.0048415 0.1800166 0.0839665 -0.0382574 0.161081 0.1684867 -0.0286577 -0.1171359 -0.0575187 0.2286461 0.1023767 0.0038413 0.024832 -0.045539 -0.0864411 0.0979444 0.0324627 0.0535082 0.0389343 -0.1175724 0.0881931 -0.0196763 0.0829675 0.0771327 0.0207483 -0.027689 0.0196048 0.0813354 0.0406322 -0.0966947 -0.0781468 -0.0757989 -0.0122389 -0.1238023 -0.0496196 -0.1026397 -0.0500831 0.4501925 0.1113015 0.0902738 0.0236558 0.2151048 -0.0316615 0.0638936 0.0330899 0.3613313 unknown
polarizability: 107.3497588|-2.8624884|82.0894374|6.5480779|5.7103306|73.9340424 unknown
InChI: InChI=1S/C6H14N2O2/c1-4(2)7-8-6(10)5(3)9/h4-5,7-9H,1-3H3
charge 0 multiplicity 1
24 atoms
O  2.852939 0.10517 1.771115
O  0.579263 1.212816 0.9305
N  -1.280522 0.00759 -0.855077
N  -0.041253 -0.56815 -0.43151
C  -2.392858 -0.16931 0.149183
C  -2.813549 -1.648622 0.204057
C  -3.548521 0.743494 -0.300564
C  2.171159 -0.64147 0.723859
C  0.829227 0.069956 0.422366
C  3.071641 -0.743083 -0.527882
H  -2.046506 0.152216 1.155913
H  -1.113142 1.015775 -1.015445
H  -3.622035 -1.789861 0.943758
H  -3.176654 -1.981072 -0.785251
H  -1.968643 -2.295007 0.504125
H  -3.248413 1.80855 -0.296707
H  -4.408288 0.635281 0.383213
H  -3.876887 0.474857 -1.320936
H  1.957597 -1.658079 1.11364
H  0.21252 -1.446254 -0.885834
H  3.21927 0.251865 -0.982441
H  4.056846 -1.131409 -0.22011
H  2.650894 -1.425586 -1.290882
H  2.331014 0.950931 1.898111
