program: Gaussian 09
title: 000298124
version: EM64L-G09RevD.01
frameworkgroup: C1[X(C16H14O5)]
method: RPBEPBE
basis: SDD
operation: Freq
keyword: #pfreq=noraman
keyword: PBEPBE/SDD
title: #p freq=noraman PBEPBE/SDD
converged: YES YES NO NO
title: Mulliken charges:
elementType: O O O O O C C C C C C C C C C C C C C C C H H H H H H H H H H H H H H
charge: -0.462116 -0.471873 -0.430017 -0.392016 -0.335069 -0.389443 -0.649638 -0.651689 0.495369 0.097949 0.440302 0.257312 0.030411 -0.647229 -0.528363 -0.386806 -0.066289 0.194754 0.087581 -0.341786 0.156329 0.226354 0.223757 0.233250 0.235240 0.232962 0.247082 0.266114 0.243874 0.279585 0.246673 0.391343 0.399360 0.386648 0.380084
chargesum: 0.00000
title: Mulliken charges with hydrogens summed into heavy atoms:
elementType: O O O O O C C C C C C C C C C C C C C C C
charge: -0.070773 -0.072513 -0.043369 -0.011932 -0.335069 0.060668 -0.181148 -0.171644 0.495369 0.097949 0.440302 0.257312 0.030411 -0.381115 -0.284489 -0.107221 -0.066289 0.194754 0.087581 -0.095113 0.156329
polarizability: 3.43828293e+02 8.24898248e+00 1.95107301e+02 -3.15293247e+00 5.57595830e+00 1.12655025e+02
1716.lowfreq: -6.7962 -0.0008 -0.0007 -0.0002 5.0751 13.7604 40.3288 63.7896 67.7865
frequency: 40.3202 63.7868 67.7390 105.1054 160.7326 161.7078 164.1556 192.8589 220.9846 246.4451 260.7171 282.0614 299.7577 319.9401 329.1212 345.7263 354.3356 364.6026 391.2893 403.3674 417.2060 422.3435 439.6245 468.9660 486.7791 488.9973 506.0102 557.3006 570.0612 583.8768 618.5989 635.3680 644.3931 669.8577 718.6438 720.1827 729.8961 757.1919 767.8777 793.6846 827.9112 844.0183 861.9008 869.6784 880.1103 917.4612 943.4549 966.3289 991.1447 1005.4908 1041.8013 1055.9421 1074.1320 1096.9442 1137.4079 1162.2899 1163.6570 1170.7865 1175.7627 1219.9573 1239.2481 1249.4336 1259.1319 1266.8550 1277.7366 1295.6143 1302.7584 1328.0316 1331.2497 1342.3489 1376.6601 1397.6764 1411.0000 1429.8166 1453.0566 1464.4026 1476.2598 1479.1315 1483.1492 1513.9105 1543.0368 1587.3727 1608.0808 1627.9164 1641.4708 2983.8345 2988.6975 2999.5411 3003.3521 3041.4219 3057.9203 3064.6510 3100.4265 3114.8102 3137.0268 3163.1062 3526.1210 3540.4068 3561.5689
redmass: 7.1508 8.2515 6.3311 4.7289 7.6107 5.8256 4.0229 4.1287 6.2325 3.7783 5.0790 5.0090 5.1221 4.4500 3.6885 5.2599 2.1950 2.8750 3.7139 2.1050 3.8980 1.1845 3.3926 6.7242 1.6026 2.1518 4.7957 5.7813 4.2816 4.3463 4.2257 4.7982 5.6375 5.3279 6.1654 4.4977 5.4567 4.8410 1.9606 3.4394 3.2228 1.1489 1.5408 1.3121 2.9476 1.4706 2.3526 3.6845 1.3192 3.4103 1.9254 2.5892 3.1913 2.7576 1.9415 1.4029 1.5609 1.4206 1.5388 1.6030 1.6625 1.7033 1.9212 2.0249 1.9311 1.3443 2.4367 1.4007 1.3827 1.3892 3.9205 3.9949 4.6060 1.7772 4.2516 1.0917 3.7496 1.2830 1.1161 4.3672 3.9151 5.3022 7.2995 6.8351 7.4812 1.0591 1.0641 1.0623 1.0611 1.0989 1.1002 1.1035 1.0868 1.0876 1.0907 1.0921 1.0651 1.0656 1.0653
irintensity: 2.3231 0.5856 0.4805 0.6402 0.1022 2.4393 1.1867 0.2878 1.6295 3.6647 2.9706 9.3508 6.6628 2.0118 10.0695 30.2747 30.1144 19.7644 12.6692 74.8510 5.9498 135.8509 4.8045 34.0563 73.6118 57.4047 2.3944 2.7474 4.4295 4.5474 3.7662 3.3016 35.3656 4.5504 11.7958 2.1209 4.3683 1.4435 24.9520 6.1097 1.2796 124.7625 20.3823 3.0833 7.3128 38.3833 5.5183 66.2412 2.4439 52.7455 15.1611 2.5977 6.2565 13.0170 5.6571 79.7368 163.3247 29.8692 51.5867 247.8352 150.5815 485.3337 39.0236 71.7470 190.2389 3.0498 5.3434 5.9526 19.3897 3.0122 49.9205 56.6048 51.6818 356.8749 20.5057 6.0496 19.3681 13.6687 37.7883 51.9417 59.9552 18.3808 55.8055 10.4925 163.9785 28.0678 39.1773 14.6672 142.5460 23.3273 33.8125 29.7884 7.5436 5.7776 6.0624 3.7967 123.8655 61.6769 84.5716
temp: 298.150 k
press: 1.00000 atm
elementType: 8 8 8 8 8 6 6 6 6 6 6 6 6 6 6 6 6 6 6 6 6 1 1 1 1 1 1 1 1 1 1 1 1 1 1
symmnumber: 1
zpe: 698894.5 jmol-1
zpe.correction: 0.266195 hartree
zpe.thermalcorrener: 0.283878 hartree
zpe.thermalcorrenthalpy: 0.284822 hartree
zpe.thermalcorrgfe: 0.221841 hartree
zpe.sumelectzpe: -992.708590 hartree
zpe.sumelectthermal: -992.690906 hartree
zpe.sumelectthermalent: -992.689962 hartree
zpe.sumelectthermalfe: -992.752943 hartree
dipole: 2.0172 -0.3825 0.5185
dipole: 2.1176
quadrupole: -152.4527 -111.4648 -121.9603
quadrupole: -2.6621 3.7433 -1.4833
quadrupole: -23.8268 17.1611 6.6657 -2.6621 3.7433 -1.4833
hfenergy: -992.9747845 hartree
pointgroup: C01 [X(C16H14O5)]
dipole: -0.7812951 -0.1977243 -0.2111749 debye
polarizability: 344.2648284|-1.5778618|193.6383207|2.8397324|-10.8176982|113.6874706 unknown
InChI: InChI=1S/C16H14O5/c17-11-5-4-10-8(6-12(11)18)2-1-3-9-7-13(19)15(20)16(21)14(9)10/h4-7,17,19-21H,1-3H2
charge 0 multiplicity 1
35 atoms
O  -1.147853 -2.385067 -0.721777
O  -3.875156 -2.284957 -0.592445
O  -5.194382 -0.020378 0.263742
O  4.877035 -1.384891 0.944687
O  5.014139 0.742768 -0.405058
C  -0.213189 3.060543 -0.293527
C  -0.881758 2.382226 0.938148
C  0.42277 2.033111 -1.276151
C  -1.665683 1.138768 0.554009
C  -0.945883 -0.028281 0.139903
C  1.27488 0.979256 -0.570399
C  0.55452 -0.071944 0.133628
C  -1.697222 -1.173761 -0.24151
C  -3.076462 1.13077 0.595353
C  2.662493 1.145808 -0.670774
C  1.141299 -1.142436 0.846317
C  -3.104103 -1.17346 -0.206351
C  -3.799785 -0.021361 0.220378
C  3.781866 0.385085 -0.17572
C  2.497524 -1.511025 1.057534
C  3.650809 -0.864096 0.619406
H  -0.963742 3.649572 -0.854514
H  0.560769 3.767515 0.062404
H  -0.0900 2.110568 1.663257
H  -1.539661 3.11101 1.443879
H  1.031768 2.577143 -2.019219
H  -0.393167 1.529097 -1.82739
H  -3.632511 2.013204 0.924473
H  3.000335 2.016872 -1.248985
H  0.425946 -1.791804 1.370254
H  2.672313 -2.410202 1.661111
H  -0.162896 -2.317165 -0.810558
H  -3.273481 -3.016553 -0.885134
H  -5.52981 -0.905732 -0.038233
H  5.537278 -0.721604 0.520959
